program: Gaussian 09
title: 000255685
version: EM64L-G09RevD.01
frameworkgroup: C1[X(C10H11Cl2NO3S)]
method: RPBEPBE
basis: SDD
operation: Freq
keyword: #p
keyword: freq=noraman
keyword: PBEPBE/SDD
title: #p freq=noraman PBEPBE/SDD
converged: NO YES NO NO
title: Mulliken charges:
elementType: Cl Cl S O O O N C C C C C C C C C C H H H H H H H H H H H
charge: 0.014432 0.019246 0.901130 -0.244742 -0.525325 -0.525832 -0.262505 -0.401555 -0.416346 -0.289923 -0.287875 0.013844 -0.249619 -0.231216 -0.046355 -0.173567 -0.095216 0.240768 0.254527 0.254305 0.271792 0.223639 0.238490 0.218363 0.226702 0.319275 0.282159 0.271404
chargesum: 0.00000
title: Mulliken charges with hydrogens summed into heavy atoms:
elementType: Cl Cl S O O O N C C C C C C C C C C
charge: 0.014432 0.019246 0.901130 -0.244742 -0.525325 -0.525832 -0.262505 0.093740 0.109750 0.172206 0.157190 0.013844 0.069657 0.050943 -0.046355 0.097837 -0.095216
polarizability: 2.42053295e+02 -1.01905259e+01 1.63872873e+02 4.60624597e+00 4.84633319e+00 1.12685275e+02
1716.lowfreq: -9.8192 -0.0020 0.0011 0.0014 1.9146 6.9777 8.7877 23.6921 42.2129
frequency: -6.0684 23.3017 42.1596 88.7467 108.6728 110.3442 158.5263 164.9157 186.5641 204.4560 212.8619 237.7601 256.2828 286.3291 304.3639 337.3999 378.0816 391.9191 405.8026 411.7723 433.7371 445.3471 473.9184 478.5155 528.5520 559.4178 622.6398 651.3095 699.6228 746.6084 779.7855 791.3307 803.4835 811.5299 817.7121 873.1583 910.2291 925.4160 954.4281 994.3491 995.8389 1013.7906 1022.6752 1062.5880 1063.6382 1098.0886 1110.7041 1115.9109 1139.3501 1183.3035 1237.5025 1243.1736 1256.5195 1289.5016 1319.4078 1337.1096 1341.6949 1362.1838 1370.2523 1373.9756 1415.5034 1422.2559 1432.8195 1452.1942 1462.6555 1562.1880 1583.3093 2956.9522 2983.8905 2994.4082 2999.6809 3065.3842 3071.9928 3082.6647 3088.4332 3161.0591 3165.7755 3182.8339
redmass: 4.4606 8.5999 7.8870 6.9430 6.6240 8.1450 3.6765 8.1810 13.0918 6.5997 8.6677 7.5797 5.7439 5.8986 3.2879 3.6174 4.3851 3.7363 8.9982 3.3934 6.2058 3.3168 3.1891 6.3589 6.9441 5.3987 2.1494 7.2890 4.2412 9.1982 4.9316 14.2755 1.8941 3.1124 1.3471 2.9426 1.3873 13.7534 1.3690 8.4287 2.6505 2.3452 1.9604 2.3340 4.6209 2.1249 5.4394 3.3787 1.3185 1.0744 1.3006 1.1671 1.2268 1.1376 1.2468 1.2337 1.2966 3.2371 1.2435 9.9295 1.0810 1.0830 2.3627 1.0792 1.0884 6.8027 8.7656 1.0678 1.0655 1.0600 1.0618 1.1004 1.0999 1.0979 1.1019 1.0925 1.0888 1.0980
irintensity: 0.1534 0.4792 0.1098 1.9254 2.0776 2.6232 2.5356 1.8317 0.1242 4.6151 6.3061 11.1816 2.6079 5.1462 5.8010 18.6678 24.8016 2.0009 51.1989 23.7803 2.9871 12.1389 1.1784 23.8823 14.1317 26.1268 95.9131 29.3593 1.3592 25.8661 10.5190 92.0203 11.4418 45.5637 26.4523 1.9591 18.0774 61.4150 0.7010 48.5422 1.2442 15.7201 17.1158 35.1671 21.4648 13.2213 11.5301 56.3180 7.0862 1.2933 6.4154 25.0920 5.3124 14.2512 0.8767 2.9720 2.8250 43.8299 4.9543 4.8732 28.9965 8.3657 84.1516 6.2183 15.8079 6.3439 12.0248 32.7496 21.5591 5.9285 19.1656 14.5782 4.2350 30.5026 27.0279 14.6140 0.7616 2.1253
temp: 298.150 k
press: 1.00000 atm
elementType: 17 17 16 8 8 8 7 6 6 6 6 6 6 6 6 6 6 1 1 1 1 1 1 1 1 1 1 1
symmnumber: 1
zpe: 518177.8 jmol-1
zpe.correction: 0.197363 hartree
zpe.thermalcorrener: 0.213476 hartree
zpe.thermalcorrenthalpy: 0.214421 hartree
zpe.thermalcorrgfe: 0.152635 hartree
zpe.sumelectzpe: -1984.785649 hartree
zpe.sumelectthermal: -1984.769536 hartree
zpe.sumelectthermalent: -1984.768592 hartree
zpe.sumelectthermalfe: -1984.830377 hartree
dipole: -0.5304 -1.4602 -3.3092
dipole: 3.6557
quadrupole: -131.2683 -114.8705 -129.0971
quadrupole: -0.1615 -4.6060 1.6395
quadrupole: -6.1897 10.2081 -4.0185 -0.1615 -4.6060 1.6395
hfenergy: -1984.9830127 hartree
pointgroup: C01 [X(C10H11Cl2N1O3S1)]
dipole: -0.3783661 -1.1075776 0.8358761 debye
polarizability: 240.335507|-5.8518441|113.1266102|15.2653219|5.9814714|165.1493263 unknown
InChI: InChI=1S/C10H11Cl2NO3S/c11-9-2-1-8(7-10(9)12)17(14,15)13-3-5-16-6-4-13/h1-2,7H,3-6H2
charge 0 multiplicity 1
28 atoms
Cl -3.989772 0.145845 -2.460448
Cl -5.444932 0.005311 0.476917
S  0.936118 0.923276 0.028491
O  4.347625 -1.383031 -0.265201
O  1.228814 1.233767 -1.553911
O  1.369866 1.96201 1.210991
N  1.59448 -0.814234 0.580722
C  1.908072 -1.66326 -0.614375
C  2.764871 -0.645379 1.49971
C  3.269914 -1.349865 -1.271013
C  4.09574 -0.369946 0.773747
C  -0.924143 0.628365 0.167531
C  -1.64371 0.503172 -1.028493
C  -1.511216 0.591765 1.442136
C  -3.038337 0.310277 -0.935966
C  -2.906513 0.399986 1.515208
C  -3.663989 0.253875 0.330889
H  1.087841 -1.576715 -1.349507
H  1.909955 -2.700358 -0.225346
H  2.823394 -1.601042 2.056309
H  2.532985 0.164305 2.213974
H  3.531966 -2.123875 -2.010821
H  3.234856 -0.358394 -1.766656
H  4.082669 0.646088 0.322916
H  4.945823 -0.443068 1.471753
H  -1.137345 0.580536 -1.996108
H  -0.909787 0.723427 2.34568
H  -3.413347 0.363366 2.483469
