program: Gaussian 09
title: 000255678
version: EM64L-G09RevD.01
frameworkgroup: C1[X(C14H17NO6)]
method: RPBEPBE
basis: SDD
operation: Freq
keyword: #p
keyword: freq=noraman
keyword: PBEPBE/SDD
title: #p freq=noraman PBEPBE/SDD
converged: YES YES NO NO
title: Mulliken charges:
elementType: O O O O O O N C C C C C C C C C C C C C C H H H H H H H H H H H H H H H H H
charge: -0.287357 -0.273029 -0.261582 -0.416576 -0.218746 -0.268000 -0.495977 0.207636 -0.048495 0.339559 0.277788 -0.796465 -0.753081 -0.368709 0.156560 0.145879 -0.258104 0.115705 0.095165 -0.665815 -0.513524 0.318387 0.236248 0.257547 0.241866 0.263465 0.202477 0.268892 0.246648 0.220695 0.235396 0.217218 0.250359 0.225033 0.382654 0.233324 0.248307 0.238652
chargesum: 0.00000
title: Mulliken charges with hydrogens summed into heavy atoms:
elementType: O O O O O O N C C C C C C C C C C C C C C
charge: -0.287357 -0.273029 -0.261582 -0.033922 -0.218746 -0.268000 -0.177590 0.207636 -0.048495 0.339559 0.277788 -0.060803 -0.018247 -0.122060 0.156560 0.145879 0.197987 0.115705 0.095165 0.026795 0.206759
polarizability: 3.20859023e+02 -7.11998617e+00 1.97271902e+02 -1.67990355e+01 3.78417294e+00 1.16846756e+02
1716.lowfreq: -0.0005 0.0003 0.0008 0.2469 5.2942 8.9951 20.1266 32.5662 36.3584
frequency: 20.1077 32.5140 36.3544 52.4667 64.5642 70.2645 83.4046 84.8966 89.6518 101.0863 119.0978 137.7990 140.0216 161.8119 169.0109 200.2339 215.0438 231.4929 237.3560 266.5924 274.1084 291.3197 317.8095 328.7099 340.0159 382.1396 392.5769 411.5044 443.8801 475.8293 531.4992 562.9389 578.2593 598.1599 627.9755 634.1958 639.1284 680.7889 703.8833 721.0465 728.1914 743.0626 747.8030 785.7525 812.5717 828.6224 864.0924 899.3500 953.1068 989.6247 999.2941 1009.1616 1036.0694 1040.2421 1042.1270 1052.7540 1076.8935 1096.2838 1110.2241 1139.0595 1145.9993 1154.1734 1190.4641 1211.3819 1247.2255 1279.6426 1316.8543 1334.0103 1358.7996 1390.6521 1391.2468 1403.6229 1410.9422 1419.8676 1429.0003 1440.8421 1446.0553 1450.1382 1456.9862 1462.6637 1463.0489 1465.5776 1473.3489 1484.4503 1496.4533 1511.6966 1563.9494 1591.0955 1606.0502 1622.8006 1649.2782 2991.5823 2992.0383 2994.8570 3002.4336 3029.9876 3053.4879 3081.1982 3081.3850 3086.3890 3091.0143 3092.6108 3103.0326 3118.1084 3119.0250 3147.7362 3531.2024 3577.1587
redmass: 5.2105 3.6583 3.8086 5.0945 4.6243 5.5797 1.3066 2.8891 3.9779 1.1441 4.2624 2.2672 4.2037 3.7445 2.0226 1.7644 3.2612 1.8782 3.5439 4.6276 3.6121 4.8634 2.9015 3.7130 3.7875 4.7552 7.5960 4.8230 3.8831 3.9404 3.2092 2.8077 3.5841 2.1418 4.4610 1.6411 2.2310 5.5634 7.2360 4.6220 4.3163 7.0958 7.5951 5.1461 1.3747 3.5718 3.1968 8.2509 1.5173 1.6223 2.7972 5.2207 1.4852 1.6433 2.9733 2.6279 2.6729 2.1547 1.2712 3.9338 1.4463 1.6678 3.1828 2.5353 2.8911 1.1160 2.3440 2.5110 1.5356 1.6923 1.2329 1.2143 1.2813 1.5291 2.1099 1.0612 1.8036 1.0562 1.1360 1.0740 1.0467 1.1747 1.1169 1.0563 2.1287 4.0511 4.3991 8.1868 8.8652 9.3115 9.2141 1.0371 1.0362 1.0413 1.0295 1.0590 1.0861 1.0912 1.0967 1.0977 1.1001 1.1030 1.1042 1.1059 1.0999 1.1049 1.0642 1.0809
irintensity: 0.4330 0.3811 0.3068 1.7474 1.2250 5.2450 1.0026 0.1366 0.1263 0.4863 1.2538 2.2949 2.1352 2.1647 0.3246 3.3181 7.5731 3.3813 3.1051 2.9149 0.7581 8.5416 5.9795 17.1967 13.2018 2.2995 1.5493 14.5693 3.4507 26.0804 22.5057 94.6319 14.2300 78.4955 8.3895 58.6981 36.4098 1.2631 22.5454 9.1804 16.9933 16.9463 7.0073 7.1563 2.3274 0.4383 9.8392 5.8072 52.1637 6.0993 18.3358 168.2283 15.5565 82.2794 312.6281 239.1568 497.2269 12.1947 1.7709 74.7921 17.7795 27.1699 142.6928 41.1980 58.6424 6.1156 70.4197 237.8895 43.9987 19.9939 25.5637 12.9957 6.0603 28.2024 32.6049 14.9964 62.0347 11.7021 94.7635 7.9161 17.5000 38.2287 22.7652 20.7972 26.9351 28.3554 102.2085 845.3471 137.0445 135.9816 325.2345 25.7106 21.7479 10.4658 28.7828 36.3370 2.1949 10.1893 8.4619 41.1299 17.2533 2.9201 23.8501 27.7325 5.1578 12.3603 72.5237 57.6521
temp: 298.150 k
press: 1.00000 atm
elementType: 8 8 8 8 8 8 7 6 6 6 6 6 6 6 6 6 6 6 6 6 6 1 1 1 1 1 1 1 1 1 1 1 1 1 1 1 1 1
symmnumber: 1
zpe: 767795.5 jmol-1
zpe.correction: 0.292438 hartree
zpe.thermalcorrener: 0.315428 hartree
zpe.thermalcorrenthalpy: 0.316372 hartree
zpe.thermalcorrgfe: 0.237927 hartree
zpe.sumelectzpe: -1048.225558 hartree
zpe.sumelectthermal: -1048.202568 hartree
zpe.sumelectthermalent: -1048.201624 hartree
zpe.sumelectthermalfe: -1048.280069 hartree
dipole: -2.5428 0.4743 2.1513
dipole: 3.3643
quadrupole: -125.6846 -108.1987 -123.4064
quadrupole: 5.3533 8.9821 -1.5956
quadrupole: -6.5880 10.8979 -4.3098 5.3533 8.9821 -1.5956
hfenergy: -1048.517996 hartree
pointgroup: C01 [X(C14H17N1O6)]
dipole: 0.8989272 -0.9352416 0.2631748 debye
polarizability: 314.4724329|-38.1354121|145.2024476|8.2190518|35.0917743|175.302801 unknown
InChI: InChI=1S/C14H17NO6/c1-5-21-14(19)11-7(2)10(15-8(11)3)6-9(12(16)17)13(18)20-4/h6,15-16H,5H2,1-4H3
charge 0 multiplicity 1
38 atoms
O  3.251756 0.330274 1.036001
O  4.125501 -1.188304 -0.507491
O  -2.317672 -0.203769 1.802159
O  -5.162844 1.003389 -0.127233
O  -2.903453 2.027409 1.474621
O  -4.452405 0.450527 -2.268601
N  0.110308 -1.339711 -1.915093
C  0.570538 0.083904 -0.197059
C  1.768436 -0.627382 -0.58205
C  -0.477056 -0.390099 -1.034639
C  1.4444 -1.51343 -1.65239
C  0.459318 1.186762 0.818533
C  2.290745 -2.486892 -2.415352
C  -1.871076 -0.096855 -1.227052
C  3.138028 -0.542621 -0.056645
C  -2.843986 0.471794 -0.424767
C  4.622254 0.484658 1.613197
C  -2.696797 0.884856 1.006846
C  -4.177074 0.643505 -1.054092
C  5.410594 1.563319 0.864374
C  -2.219062 0.08409 3.254802
H  -0.413805 -1.862376 -2.617305
H  0.322786 0.776171 1.836579
H  1.384178 1.782464 0.844504
H  -0.390667 1.853131 0.602068
H  2.727476 -3.243438 -1.740367
H  1.705315 -3.000379 -3.199312
H  3.149382 -1.975282 -2.882814
H  -2.26117 -0.379019 -2.220333
H  4.430182 0.765375 2.661392
H  5.135864 -0.49134 1.565884
H  6.386067 1.725053 1.359961
H  5.600977 1.25555 -0.177337
H  4.862883 2.521722 0.860733
H  -6.028467 1.107008 -0.605813
H  -1.848263 -0.849539 3.700264
H  -3.214021 0.347218 3.651477
H  -1.526072 0.922256 3.440248
