program: Gaussian 09
title: 000255665
version: EM64L-G09RevD.01
frameworkgroup: C1[X(C9H11NO3)]
method: RPBEPBE
basis: SDD
operation: Freq
keyword: #p
keyword: freq=noraman
keyword: PBEPBE/SDD
title: #p freq=noraman PBEPBE/SDD
converged: YES YES NO NO
title: Mulliken charges:
elementType: O O O N C C C C C C C C C H H H H H H H H H H H
charge: -0.254877 -0.244724 -0.233980 -0.378513 0.273971 -0.591326 0.135746 -0.343880 0.268124 -0.209456 -0.278751 -0.256213 -0.664778 0.252943 0.263325 0.343519 0.250828 0.261504 0.251543 0.224518 0.238503 0.216741 0.250605 0.224628
chargesum: 0.00000
title: Mulliken charges with hydrogens summed into heavy atoms:
elementType: O O O N C C C C C C C C C
charge: -0.254877 -0.244724 -0.233980 -0.034994 0.273971 -0.075058 0.135746 -0.093051 0.268124 0.052048 -0.027208 0.206808 0.027196
polarizability: 1.70355200e+02 9.76204154e+00 1.02157870e+02 2.15556482e+00 1.39646277e+00 7.21754049e+01
1716.lowfreq: -14.9082 -6.8772 -3.1423 0.0003 0.0010 0.0011 7.5393 30.2282 52.9162
frequency: 5.8645 30.0399 52.8567 79.7737 103.0971 129.1500 165.6448 172.9508 206.5515 278.8965 301.9176 362.7263 434.5788 486.1486 524.2465 577.3318 600.8516 636.5125 671.5208 706.8180 747.5674 752.3657 810.3522 811.8473 829.6465 874.4895 891.1948 892.2252 923.9575 942.9963 1012.1744 1027.7714 1057.3988 1095.0845 1097.2036 1118.3361 1132.8081 1158.1408 1231.9160 1258.5126 1269.4873 1278.2261 1327.3023 1357.0764 1389.3147 1402.5015 1423.9307 1429.9389 1441.1182 1457.2202 1463.1327 1485.0932 1534.7209 1575.6773 1652.3759 2992.4363 3018.8542 3032.9696 3087.1434 3087.4637 3093.8547 3120.5008 3210.6394 3224.2744 3245.4391 3565.9857
redmass: 4.2420 4.3979 2.9960 4.8758 4.4943 4.8227 6.5491 5.3193 1.2133 2.6566 3.5947 3.0728 3.0297 6.5946 4.0222 8.6884 2.8203 4.1832 3.8472 1.1633 2.1062 1.4051 1.5192 3.8282 1.3543 5.7252 1.3667 4.2145 3.2393 2.5369 2.3914 2.2840 1.3264 2.2954 2.3722 1.7297 1.2966 1.6741 1.6994 1.4670 1.8026 1.1399 4.1858 1.2923 1.2351 5.1454 1.5998 2.0789 3.4356 1.0908 1.0455 1.0516 4.0692 8.0103 9.5892 1.0359 1.0590 1.0593 1.1013 1.0973 1.1030 1.1066 1.0917 1.0970 1.1081 1.0813
irintensity: 0.7847 1.5076 1.2086 0.5764 4.6960 4.1391 2.0015 1.0763 5.3049 12.8403 3.0815 9.0939 3.4503 4.4615 2.0105 4.1160 13.6105 22.8936 12.0840 47.6348 10.2178 135.0587 3.9769 2.1579 19.6621 1.0969 0.1782 74.9424 9.1380 3.3651 45.9129 74.3046 23.2741 69.9946 30.6892 187.0190 18.6149 11.1899 208.3888 5.4019 46.7116 16.8395 111.2505 4.2718 23.2082 47.9071 48.4194 51.5571 64.7466 12.3231 13.3622 12.5695 11.3881 260.2275 194.8217 22.0305 7.8130 25.4421 2.1690 36.0599 1.7423 31.6916 3.3056 2.0710 1.7982 84.1162
temp: 298.150 k
press: 1.00000 atm
elementType: 8 8 8 7 6 6 6 6 6 6 6 6 6 1 1 1 1 1 1 1 1 1 1 1
symmnumber: 1
zpe: 492623.1 jmol-1
zpe.correction: 0.187630 hartree
zpe.thermalcorrener: 0.200715 hartree
zpe.thermalcorrenthalpy: 0.201660 hartree
zpe.thermalcorrgfe: 0.144339 hartree
zpe.sumelectzpe: -629.012920 hartree
zpe.sumelectthermal: -628.999835 hartree
zpe.sumelectthermalent: -628.998891 hartree
zpe.sumelectthermalfe: -629.056211 hartree
dipole: -2.1039 -0.9871 -2.0460
dipole: 3.0963
quadrupole: -53.7456 -71.2257 -84.2030
quadrupole: -2.2122 -4.8120 0.1304
quadrupole: 15.9791 -1.5009 -14.4782 -2.2122 -4.8120 0.1304
hfenergy: -629.2005507 hartree
pointgroup: C01 [X(C9H11N1O3)]
dipole: -0.8359793 0.5730532 0.6757962 debye
dipolederiv: -1.2870236 0.0514106 -0.3925114 0.201494 -0.3078873 0.0295438 -0.5581047 -0.0078279 -0.8607447 -0.8820336 0.0830835 0.0129061 0.4752697 -0.8647616 0.0793837 -0.067744 0.1074768 -0.3182638 -0.6947223 0.0736166 0.1845051 0.105267 -0.3133029 -0.1816193 -0.1179646 -0.0583597 -0.9193545 0.0955461 0.1263147 -0.0455254 0.2018435 -0.5927239 0.0664323 -0.0674919 0.0722878 -0.2234293 -1.2406549 0.2809294 0.014185 0.2195902 0.1003287 -0.0421503 0.0329506 -0.0473113 -0.0341058 -0.6381993 -0.1013379 0.0908576 -0.383254 -0.1966525 0.0610033 0.0860117 0.0282881 0.0445699 2.0510817 -0.1432388 -0.0703596 -0.0532098 0.9358988 -0.1473588 -0.0744643 -0.1425725 0.1829179 0.451075 -0.0246495 -0.0343756 -0.2054668 -0.0175832 -0.0197778 0.0043812 -0.0314823 -0.1738405 1.5534919 -0.1774978 0.1247178 -0.3210178 0.2058578 0.2103657 0.6111537 0.108867 1.4557258 -0.2634725 -0.1374606 0.0339279 0.2096785 0.2529405 -0.093513 -0.0338413 -0.0713519 -0.1238236 -0.292146 -0.0451942 0.0112574 -0.3904343 -0.0572961 -0.0155041 0.0799429 -0.0384487 -0.2437132 0.8639036 -0.0252538 0.1571208 -0.1267864 0.3127906 -0.1140706 0.0357775 -0.0192242 0.2742761 -0.1525028 -0.065549 0.0006524 -0.0486328 -0.0469322 0.0875544 0.0361794 0.0409414 0.023961 -0.0051118 0.0395211 -0.0451075 0.0651098 0.0681625 0.0431788 -0.0353282 0.0711481 0.0131138 0.0499289 0.0000201 0.014686 0.0318501 0.0562735 -0.0603341 0.032455 -0.0749558 0.0206831 0.2465512 0.0539081 -0.0040651 0.0026396 0.2718164 0.0117268 0.005067 0.0072417 0.3250909 0.0937015 -0.0826126 0.0240816 -0.0752762 0.01443 0.0388515 0.0239106 0.0412247 0.1717829 0.0273269 -0.0532968 0.0236259 -0.0645416 0.0559814 0.0366277 0.0282273 0.0360772 0.2042074 -0.0116932 0.0814897 -0.0026885 0.0865512 0.0589509 0.0236525 -0.0036259 0.0242068 0.1962805 -0.0129473 -0.0042311 -0.0165381 0.0264858 0.0551053 0.0775247 -0.0350683 0.1075164 -0.0949622 -0.0092791 -0.0328253 -0.0375076 0.0192453 -0.0429801 -0.0410666 0.040546 -0.1197344 0.0392045 -0.1727282 0.0789902 -0.0260236 0.0789224 0.0528368 0.0003112 -0.0094038 0.0091642 0.1216144 0.1233364 0.0132257 -0.0518095 -0.0127887 0.060491 0.0530589 -0.0179647 0.0798994 -0.0795604 0.1065714 0.0106377 0.0339883 -0.0425389 -0.0617441 -0.1038206 0.0043985 -0.1230708 -0.0016303 unknown
polarizability: 170.7302794|-8.6173015|100.358424|0.1815211|-6.4827462|73.5997711 unknown
InChI: InChI=1S/C9H11NO3/c1-2-13-9(12)6-8(11)7-4-3-5-10-7/h3-5,10H,2,6H2,1H3
charge 0 multiplicity 1
24 atoms
O  2.664032 0.361926 0.622271
O  -0.076961 -1.402607 0.162568
O  2.409763 0.029011 -1.675923
N  -2.816224 -0.844303 0.236088
C  -1.868381 0.151155 -0.035465
C  0.548409 0.931423 -0.333747
C  -0.452022 -0.206545 -0.055787
C  -2.580821 1.358741 -0.236804
C  1.95109 0.399184 -0.573174
C  -4.085747 -0.306296 0.211993
C  -3.969925 1.070887 -0.080107
C  4.036618 -0.232022 0.559927
C  5.072175 0.828185 0.174933
H  0.22287 1.493981 -1.225817
H  0.549601 1.616021 0.533449
H  -2.539422 -1.811842 0.413387
H  -2.141145 2.328048 -0.46831
H  -4.971755 -0.910669 0.395933
H  -4.798149 1.771507 -0.168731
H  4.1947 -0.618588 1.579199
H  4.021841 -1.063748 -0.165732
H  6.086939 0.390775 0.220205
H  4.898849 1.188703 -0.852752
H  5.035665 1.686371 0.868192
