program: Gaussian 09
title: 000255664
version: EM64L-G09RevD.01
frameworkgroup: C1[X(C6H6ClNO)]
method: RPBEPBE
basis: SDD
operation: Freq
keyword: #p
keyword: freq=noraman
keyword: PBEPBE/SDD
title: #p freq=noraman PBEPBE/SDD
converged: NO NO NO NO
title: Mulliken charges:
elementType: Cl O N C C C C C C H H H H H H
charge: -0.020054 -0.225507 -0.376744 0.277140 -0.359675 0.190240 -0.204707 -0.267166 -0.684513 0.344936 0.251736 0.262830 0.252719 0.279366 0.279397
chargesum: 0.00000
title: Mulliken charges with hydrogens summed into heavy atoms:
elementType: Cl O N C C C C C C
charge: -0.020054 -0.225507 -0.031807 0.277140 -0.107939 0.190240 0.058123 -0.014447 -0.125750
polarizability: 1.29361421e+02 -9.80829820e+00 7.99675985e+01 -4.82754389e-04 -1.51942159e-03 3.70550839e+01
1716.lowfreq: -26.1567 -8.8520 -8.7562 -0.0032 -0.0028 -0.0019 7.2735 93.6939 119.1515
frequency: -25.8320 93.6699 119.1478 170.2304 226.9942 309.1500 484.0192 514.1665 600.5185 667.1463 700.7321 709.2220 743.8780 752.2058 827.6785 874.2687 891.6131 916.1659 919.9074 1020.5276 1058.0967 1094.2891 1133.9407 1141.5551 1250.4357 1260.1229 1324.0471 1403.5660 1419.5534 1427.7062 1438.8688 1536.7021 1581.8161 3036.4202 3111.2130 3208.0533 3222.5045 3244.4324 3565.0805
redmass: 3.3345 3.9688 5.9375 5.6190 12.7564 7.4577 6.5696 3.0392 2.8219 3.7082 8.0236 1.1656 6.8722 1.2186 1.3209 5.7925 1.3675 1.9610 4.0203 2.0394 1.3005 2.4143 1.2865 1.0939 1.4235 1.4555 3.8686 5.1738 1.1077 3.6642 3.9453 3.9020 9.2468 1.0564 1.1072 1.0923 1.0966 1.1081 1.0813
irintensity: 3.7080 8.9248 2.8006 0.2027 2.7719 5.9817 2.1552 0.7633 13.3057 6.1466 47.2396 48.4451 27.7936 147.1533 24.0718 0.3444 0.0755 3.3220 20.6899 7.2388 37.3386 89.3325 23.3759 1.1035 71.4433 3.9191 53.2044 40.2427 27.0827 60.3770 41.9145 4.8383 193.0720 16.3998 3.6332 3.2147 1.9365 1.2845 86.5109
temp: 298.150 k
press: 1.00000 atm
elementType: 17 8 7 6 6 6 6 6 6 1 1 1 1 1 1
symmnumber: 1
zpe: 287101.6 jmol-1
zpe.correction: 0.109351 hartree
zpe.thermalcorrener: 0.116804 hartree
zpe.thermalcorrenthalpy: 0.117749 hartree
zpe.thermalcorrgfe: 0.076253 hartree
zpe.sumelectzpe: -821.610569 hartree
zpe.sumelectthermal: -821.603116 hartree
zpe.sumelectthermalent: -821.602172 hartree
zpe.sumelectthermalfe: -821.643667 hartree
dipole: 4.4501 -1.8762 0.0008
dipole: 4.8294
quadrupole: -58.6926 -55.4775 -61.2726
quadrupole: 7.0156 -0.0027 -0.0012
quadrupole: -0.2117 3.0034 -2.7917 7.0156 -0.0027 -0.0012
hfenergy: -821.7199205 hartree
pointgroup: C01 [X(C6H6Cl1N1O1)]
dipole: -1.7778564 0.6703705 0.0005129 debye
dipolederiv: -0.5209277 -0.0094252 -0.0003261 0.0447579 -0.1101412 0.0001258 -0.0000566 0.0000956 -0.1431874 -0.7655895 0.0720915 -0.0002833 0.5178709 -0.8621644 -0.0011223 0.0009903 -0.0015545 -0.3142882 0.0925808 0.1339753 0.0006796 0.2074162 -0.6060261 -0.0009719 0.0009169 -0.0010757 -0.2162052 -1.1681992 0.2686305 -0.0003848 0.166931 0.1161961 0.0006976 -0.0006756 0.0007416 -0.0346321 0.4344589 -0.0188773 0.0006453 -0.1823724 -0.0160516 0.0003352 0.0001602 0.0004836 -0.1959035 1.6961322 -0.1745237 0.0012402 -0.1148441 0.9239171 0.0022513 0.001634 0.0022081 0.1409184 -0.2487518 -0.1470794 -0.000541 0.2016733 0.2664791 0.0014246 0.0005288 0.0011274 -0.1402009 -0.2690071 -0.0450596 -0.0001523 -0.3874316 -0.0543865 0.0001166 -0.0011714 0.0005034 -0.2420521 0.5478152 -0.1864434 -0.0004118 -0.448484 -0.1440282 -0.0015031 -0.0015303 -0.0012935 0.1816527 0.2329348 0.052088 0.0000583 -0.0022903 0.2747582 -0.0001738 -0.0001109 -0.000103 0.3334879 0.0902045 -0.085018 -0.0003691 -0.0779265 0.0026065 -0.0006284 -0.000334 -0.0006071 0.1860109 0.0327222 -0.0556101 -0.0003624 -0.0671734 0.0482339 -0.0005618 -0.0004667 -0.0005745 0.2157704 -0.0083755 0.0793676 -0.0000063 0.0822354 0.0581906 -0.0003253 0.0000148 -0.0003422 0.2018393 -0.0728926 0.0581034 -0.053631 0.0299117 0.0507064 0.0647081 -0.0383207 0.0764475 0.0138007 -0.0731054 0.0577804 0.0538448 0.029726 0.0517101 -0.0643724 0.0384211 -0.0760567 0.0129893 unknown
polarizability: 130.0412958|-7.8840267|79.2872946|0.0700482|0.1190837|37.0555127 unknown
InChI: InChI=1S/C6H6ClNO/c7-4-6(9)5-2-1-3-8-5/h1-3,8H,4H2
charge 0 multiplicity 1
15 atoms
Cl 3.748459 0.364527 0.005646
O  1.388601 -1.542124 -0.001941
N  -1.36323 -1.0268 -0.003386
C  -0.420558 0.008664 0.000735
C  -1.143636 1.227371 0.003685
C  1.003658 -0.333311 0.001244
C  -2.640092 -0.504823 -0.003086
C  -2.534304 0.903101 0.000987
C  1.961375 0.867362 0.006108
H  -1.082239 -2.009405 -0.006037
H  -0.714512 2.228878 0.007159
H  -3.52219 -1.142257 -0.005927
H  -3.369479 1.601331 0.002032
H  1.802771 1.486081 -0.891958
H  1.801476 1.479806 0.908241
