program: Gaussian 09
title: 000255663
version: EM64L-G09RevD.01
frameworkgroup: C1[X(C9H8N2O)]
method: RPBEPBE
basis: SDD
operation: Freq
keyword: #pfreq=noraman
keyword: PBEPBE/SDD
title: #p freq=noraman PBEPBE/SDD
converged: NO YES NO NO
title: Mulliken charges:
elementType: O N N C C C C C C C C C H H H H H H H H
charge: -0.219506 -0.426176 -0.426273 0.262104 0.262802 0.015406 -0.349418 -0.349210 -0.234762 -0.234850 -0.262192 -0.262269 0.331076 0.331182 0.275323 0.275200 0.256231 0.256211 0.249573 0.249547
chargesum: 0.00000
title: Mulliken charges with hydrogens summed into heavy atoms:
elementType: O N N C C C C C C C C C
charge: -0.219506 -0.095100 -0.095090 0.262104 0.262802 0.015406 -0.074095 -0.074010 0.021469 0.021361 -0.012619 -0.012722
polarizability: 1.77412184e+02 -1.40333767e-02 1.17199123e+02 -7.18421687e+00 -6.48699624e-03 5.54843773e+01
1716.lowfreq: -7.3825 -0.0010 -0.0009 -0.0006 5.1103 6.6335 63.3575 79.3261 116.1390
frequency: 63.3356 79.3252 116.1381 162.6476 215.2165 226.5145 343.6807 389.3870 539.1062 555.1539 590.1811 600.0219 606.3459 652.1615 717.7425 737.4574 738.4635 740.2243 817.2549 832.2122 838.9927 872.4709 873.0102 897.8612 899.7421 930.8467 983.6333 1037.7683 1038.4777 1081.8083 1100.3253 1128.3944 1134.3217 1230.0696 1241.3339 1261.9937 1309.1125 1391.2059 1394.8133 1411.2507 1415.1536 1439.9013 1448.8352 1534.9036 1543.3104 1555.2542 3213.2861 3213.3098 3230.0011 3230.0492 3244.8530 3244.9248 3578.8521 3579.1044
redmass: 4.0329 4.1398 4.5776 6.4011 5.3548 5.5216 5.4368 8.3326 1.3303 7.3609 4.4846 3.0377 2.7090 3.9130 1.1649 1.2245 1.2384 3.8856 3.6352 1.3143 1.8351 5.5051 5.5127 1.3620 1.3961 3.3099 2.1931 1.2863 1.2833 1.7340 2.7071 1.3035 1.3205 4.7055 1.6132 1.5772 4.0583 3.0885 3.2331 3.2810 3.1898 5.1156 4.3547 12.0775 3.8084 4.5430 1.0902 1.0902 1.0978 1.0979 1.1087 1.1087 1.0812 1.0809
irintensity: 0.0773 0.0749 0.2351 3.1382 1.8330 1.9124 0.0398 7.9465 154.9748 0.8343 3.6124 3.3410 2.1750 0.3882 12.7008 196.2935 31.3376 36.0244 76.3712 12.1217 23.6649 17.0631 4.7738 0.6565 5.4240 0.9388 4.7507 94.5857 3.1405 39.9045 50.6658 22.0959 33.0049 0.5533 20.2238 0.2699 158.7405 0.4956 7.8369 7.7844 5.4798 80.2072 199.5255 162.2556 1.7126 132.1095 6.1398 0.0857 0.3797 0.4961 4.5853 2.1994 25.4047 74.7434
temp: 298.150 k
press: 1.00000 atm
elementType: 8 7 7 6 6 6 6 6 6 6 6 6 1 1 1 1 1 1 1 1
symmnumber: 1
zpe: 402254.7 jmol-1
zpe.correction: 0.153211 hartree
zpe.thermalcorrener: 0.162888 hartree
zpe.thermalcorrenthalpy: 0.163832 hartree
zpe.thermalcorrgfe: 0.117431 hartree
zpe.sumelectzpe: -531.634685 hartree
zpe.sumelectthermal: -531.625007 hartree
zpe.sumelectthermalent: -531.624063 hartree
zpe.sumelectthermalfe: -531.670465 hartree
dipole: 0.0055 -5.8744 0.0048
dipole: 5.8744
quadrupole: -61.1995 -70.0298 -70.6049
quadrupole: -0.0094 -0.9925 -0.0013
quadrupole: 6.0785 -2.7517 -3.3268 -0.0094 -0.9925 -0.0013
hfenergy: -531.7878954 hartree
pointgroup: C01 [X(C9H8N2O1)]
dipole: -0.000348 -2.3111712 0.0070774 debye
dipolederiv: -0.7266454 -0.0004585 -0.0182124 -0.0016379 -1.102094 0.0003579 -0.167823 0.0038383 -0.3361901 -0.3827986 -0.3540581 0.1475741 -0.5848608 -0.1812002 0.0621179 0.0054534 0.0458668 -0.2083694 -0.3820802 0.3553623 0.1451498 0.5858205 -0.1832532 -0.0616237 0.0013038 -0.0455358 -0.2074018 -0.9406235 0.4539199 -0.0584406 0.4944782 -0.0535734 -0.1433505 0.020604 -0.1139592 -0.0152603 -0.9417734 -0.4527027 -0.0567301 -0.4928566 -0.0505477 0.1429634 0.0208472 0.1131743 -0.0167676 2.1757972 -0.0010005 0.032027 -0.0002861 1.2064514 -0.0009851 0.1050653 -0.0034691 0.1981181 0.3218895 -0.2021542 0.0084801 -0.0463957 0.0382284 -0.0728154 0.0184772 -0.0672996 -0.1568732 0.3219748 0.2012447 0.008356 0.0456957 0.0386036 0.0720784 0.0194049 0.0667796 -0.1576661 -0.0947453 0.2939111 -0.1697887 0.1154722 0.0035354 -0.0833672 -0.0211156 -0.1370428 -0.1157449 -0.0951795 -0.2948075 -0.1673714 -0.1155972 0.0051687 0.0830196 -0.0205228 0.1356077 -0.1175144 -0.0270253 -0.0309411 -0.0520304 0.2387322 -0.2387931 -0.0215064 -0.1696031 0.0330335 -0.2244268 -0.0268199 0.0304258 -0.0513295 -0.23999 -0.23819 0.0216388 -0.16803 -0.0325881 -0.224759 0.2471786 -0.0075185 0.03904 -0.0047706 0.2169475 0.013402 0.1075991 0.0208061 0.2712185 0.2472902 0.0078621 0.038723 0.0054104 0.2166721 -0.0134028 0.1074262 -0.0207544 0.2714854 0.1299935 0.0110579 0.0157657 -0.0210654 0.0348973 0.0740658 0.0110578 0.0584162 0.1620705 0.1298626 -0.0109471 0.0155322 0.0211737 0.0340849 -0.0734824 0.0107907 -0.0579109 0.1627878 0.0909733 0.0222328 0.0131396 0.0536006 0.0008623 0.0852227 0.0188879 0.0789854 0.1770661 0.0907862 -0.0221118 0.0129495 -0.0535275 0.0001929 -0.0844947 0.0189986 -0.0781747 0.1779307 -0.0688114 0.0237691 0.048831 0.0262605 0.126104 0.0262623 0.0408379 0.0242284 0.1798808 -0.0692433 -0.0230856 0.0483351 -0.025656 0.1259031 -0.0261006 0.0403405 -0.0240017 0.1804157 unknown
polarizability: 177.0943108|-0.101787|117.1989339|-9.5001546|-0.1342914|55.8024393 unknown
InChI: InChI=1S/C9H8N2O/c12-9(7-3-1-5-10-7)8-4-2-6-11-8/h1-6,10-11H
charge 0 multiplicity 1
20 atoms
O  0.0041 2.354678 -0.006172
N  1.417215 -0.99871 0.461758
N  -1.414163 -0.997996 -0.455105
C  1.271902 0.319564 -0.024689
C  -1.267612 0.322227 0.025708
C  0.002933 1.077804 0.000633
C  2.544078 0.732986 -0.467846
C  -2.540308 0.74032 0.462943
C  2.74397 -1.396175 0.347049
C  -2.741933 -1.392502 -0.341961
C  3.461694 -0.341286 -0.245843
C  -3.459293 -0.333372 0.243767
H  0.69292 -1.499073 0.977233
H  -0.689414 -1.502206 -0.966179
H  2.750386 1.707395 -0.906311
H  -2.745992 1.717239 0.896082
H  3.081573 -2.370042 0.696997
H  -3.080389 -2.367472 -0.687991
H  4.523203 -0.354711 -0.486645
H  -4.521468 -0.343666 0.48177
