program: Gaussian 09
title: 000255660
version: EM64L-G09RevD.01
frameworkgroup: C1[X(C9H10N2O)]
method: RPBEPBE
basis: SDD
operation: Freq
keyword: #p
keyword: freq=noraman
keyword: PBEPBE/SDD
title: #p freq=noraman PBEPBE/SDD
converged: YES YES NO NO
title: Mulliken charges:
elementType: O N N C C C C C C C C C H H H H H H H H H H
charge: -0.246289 -0.446305 -0.011194 -0.534604 0.408116 -0.366524 -0.418777 -0.414109 0.304231 -0.358913 -0.215355 -0.152731 0.233773 0.219344 0.228545 0.243316 0.333452 0.256873 0.248545 0.250822 0.257328 0.180457
chargesum: 0.00000
title: Mulliken charges with hydrogens summed into heavy atoms:
elementType: O N N C C C C C C C C C
charge: -0.246289 -0.112853 -0.011194 -0.081487 0.408116 0.105337 -0.161904 0.085258 0.304231 -0.101586 -0.034898 -0.152731
polarizability: 1.52878630e+02 1.13360770e+01 1.13275570e+02 -5.31499052e+00 5.19444922e+00 7.41223429e+01
1716.lowfreq: -8.1366 -1.8432 -0.0007 -0.0004 0.0003 5.4192 17.4768 57.1765 66.8354
frequency: 17.1179 57.1669 66.8321 87.9910 140.9641 152.7932 173.6695 267.4901 273.8808 333.9588 371.2950 385.6371 496.7045 528.9078 634.7832 650.6362 691.9790 707.3088 734.3397 762.9570 795.8718 831.1775 878.0561 931.7704 959.3793 982.4378 990.3549 1019.8799 1040.6605 1042.2626 1054.8382 1137.5255 1186.5931 1242.4705 1249.0795 1267.4964 1288.9157 1309.0090 1329.7837 1341.7039 1348.3756 1406.6811 1427.8506 1449.0751 1466.8156 1481.4027 1497.4830 1546.5709 1597.1751 2200.5990 2928.6313 2972.6903 2985.6666 3009.8670 3034.9410 3043.3388 3080.5646 3208.0756 3228.1883 3560.6584
redmass: 5.1025 5.2382 2.6098 2.5609 6.2514 5.0789 4.8762 4.8550 3.3039 2.6380 3.5849 3.8544 5.9437 5.7644 3.3161 4.5636 1.2853 3.2095 1.1493 4.1033 1.3069 1.3947 1.3737 5.1441 1.6958 2.9456 4.2033 5.7912 2.7650 1.6547 1.3107 1.1908 1.5648 1.3719 1.2731 1.2874 1.1061 1.5914 2.6841 1.5256 1.5021 4.3782 3.4231 1.0831 1.1049 1.1104 7.1326 4.2674 5.7069 12.4370 1.0867 1.0639 1.0587 1.0610 1.0983 1.0982 1.1048 1.0926 1.1046 1.0806
irintensity: 3.6120 1.0911 3.2193 2.3163 4.6962 10.0456 5.9990 0.5501 8.9428 5.0059 0.5596 0.9556 1.6841 6.3399 5.5449 10.4137 28.9150 33.6715 5.2276 22.2399 107.0855 1.2199 0.0316 0.3530 6.5175 2.8156 1.3398 4.8976 1.7705 7.3154 32.2917 1.3117 77.3588 20.6844 4.2800 6.9407 3.5216 14.3158 6.6413 17.1455 0.5168 55.2990 17.1244 6.3729 0.8075 15.6062 52.2162 95.2164 296.2685 13.9928 116.5111 27.3703 7.1996 20.2658 5.3916 2.9324 32.0791 3.6006 1.8390 67.2280
temp: 298.150 k
press: 1.00000 atm
elementType: 8 7 7 6 6 6 6 6 6 6 6 6 1 1 1 1 1 1 1 1 1 1
symmnumber: 1
zpe: 453925.0 jmol-1
zpe.correction: 0.172891 hartree
zpe.thermalcorrener: 0.184664 hartree
zpe.thermalcorrenthalpy: 0.185608 hartree
zpe.thermalcorrgfe: 0.132632 hartree
zpe.sumelectzpe: -532.792427 hartree
zpe.sumelectthermal: -532.780653 hartree
zpe.sumelectthermalent: -532.779709 hartree
zpe.sumelectthermalfe: -532.832685 hartree
dipole: 0.4231 -4.5395 1.9925
dipole: 4.9755
quadrupole: -97.1897 -76.3969 -70.8083
quadrupole: -0.0627 -15.5142 3.1593
quadrupole: -15.7247 5.0681 10.6567 -0.0627 -15.5142 3.1593
hfenergy: -532.9653175 hartree
pointgroup: C01 [X(C9H10N2O1)]
dipole: 0.1716063 1.753025 -0.8540086 debye
dipolederiv: -0.4939082 0.0143238 -0.0483269 0.6416272 -1.1491559 -0.0549758 0.1625194 -0.271455 -0.394748 -0.0379876 -0.1997428 -0.0199304 -0.2033523 -0.4924684 -0.1583619 0.0196717 -0.1849437 -0.2546846 -0.3189291 -0.0135647 -0.0023051 -0.0799321 -0.2407413 -0.001492 0.1100575 0.0166817 -0.2283706 -0.0296582 -0.0110327 -0.0064758 -0.1195723 0.1425984 -0.0052348 0.0430524 -0.0106988 0.1753021 0.2338108 -0.0210533 0.0860196 0.4035766 0.0929452 0.2089321 0.266824 0.0733065 0.0303424 0.1566014 0.022092 -0.0151712 0.0228772 0.0942423 0.0581151 -0.0515762 0.0939351 0.0091623 -0.5014418 0.1372596 -0.0255856 -0.1916453 0.0354721 0.0148771 -0.1711425 0.1574375 -0.2487557 -0.0633017 -0.0878901 0.0497458 -0.1376817 0.1998132 0.0625197 0.1011899 0.0608576 0.1622425 -0.7090167 0.6427997 -0.0044821 0.7225897 -0.4674901 0.1094499 -0.062862 0.1178089 0.0381872 0.2160547 -0.2032006 0.1163459 -0.3643384 0.2260967 -0.0055018 0.0547005 0.0505858 -0.1438857 1.0946079 -0.4901816 0.2179796 -0.8479956 1.3469195 0.1470519 0.1420226 0.2179613 0.237077 0.0255137 0.0789052 -0.1021811 0.1422578 0.0012596 -0.0637052 -0.2320799 -0.0817989 0.0088289 0.0235096 0.0448534 -0.021953 0.0666517 -0.0997247 0.0552085 -0.0019137 0.010729 0.0769812 -0.0092874 0.0097909 -0.0161014 -0.0234896 0.0343776 -0.114741 -0.0530749 -0.0497902 -0.1138184 0.0191233 0.0566832 -0.0111746 0.0538856 -0.0938628 0.0433282 -0.0087894 0.0191783 0.0709594 0.0618378 -0.0154045 0.0045 0.0055742 0.0405261 -0.0814536 -0.0013145 -0.0614878 -0.0784622 0.2536215 0.0278792 -0.0264252 -0.0301801 0.2286578 -0.0244998 -0.0509944 -0.0060814 0.281478 0.0867532 0.0964477 -0.0197186 0.0840327 -0.0099521 -0.0334117 -0.0219461 -0.0263849 0.1672419 0.0711675 -0.0175415 0.0423222 -0.0221395 0.0593653 -0.0732492 0.0019217 -0.0481106 -0.0552477 0.0527457 0.0165025 0.0133581 0.0524978 -0.0626759 0.0571945 0.0085842 0.0239583 0.0912808 0.0306018 -0.0525275 -0.0833468 -0.0305966 0.0971112 -0.0455826 -0.0838322 -0.0530288 0.1405215 -0.1624182 -0.035398 -0.1270933 -0.1446468 0.0166862 -0.0944677 -0.171018 -0.0486599 0.0283679 unknown
polarizability: 152.7041192|-10.7041892|113.3682737|8.2901095|3.2440356|74.2041496 unknown
InChI: InChI=1S/C9H10N2O/c10-6-2-1-3-8-4-5-9(7-12)11-8/h4-5,7,11H,1-3H2
charge 0 multiplicity 1
22 atoms
O  3.531039 -2.146866 -0.080646
N  1.368327 -0.28687 -0.373968
N  -5.111709 -1.213359 0.797955
C  -0.860692 0.77459 -0.957413
C  0.524912 0.811983 -0.371014
C  -1.887538 0.034133 -0.054395
C  1.210243 1.86357 0.285842
C  -3.298374 0.033864 -0.706604
C  2.578029 0.025654 0.260859
C  2.490537 1.374914 0.680889
C  3.632098 -0.962735 0.375515
C  -4.306342 -0.653637 0.118203
H  -1.200809 1.814521 -1.115274
H  -0.843383 0.291701 -1.956224
H  -1.562378 -1.008187 0.119812
H  -1.933684 0.524485 0.934578
H  1.193872 -1.210968 -0.774115
H  0.81213 2.864261 0.447729
H  -3.258406 -0.458903 -1.697872
H  -3.634742 1.074695 -0.880191
H  3.270932 1.924328 1.2059
H  4.554142 -0.616672 0.897134
