program: Gaussian 09
title: 000018218
version: EM64L-G09RevD.01
frameworkgroup: C1[X(C11H11F3N2)]
method: RPBEPBE
basis: SDD
operation: Freq
keyword: #p
keyword: freq=noraman
keyword: PBEPBE/SDD
title: #p freq=noraman PBEPBE/SDD
converged: YES YES NO NO
title: Mulliken charges:
elementType: F F F N N C C C C C C C C C C C H H H H H H H H H H H
charge: -0.165192 -0.169590 -0.167320 -0.439052 -0.111685 -0.620853 0.229248 -0.376137 -0.481794 0.494910 -0.359817 -0.440425 0.290498 -0.366169 -0.309740 0.261021 0.260927 0.228949 0.220666 0.228567 0.230489 0.230457 0.298180 0.262222 0.245448 0.265898 0.260296
chargesum: 0.00000
title: Mulliken charges with hydrogens summed into heavy atoms:
elementType: F F F N N C C C C C C C C C C C
charge: -0.165192 -0.169590 -0.167320 -0.140872 -0.111685 -0.130977 0.229248 0.073096 -0.020847 0.494910 -0.097596 -0.194977 0.290498 -0.100271 -0.049445 0.261021
polarizability: 1.71397788e+02 -2.94418384e+00 1.13091441e+02 -1.32678583e+01 1.17467003e+01 1.01585385e+02
1716.lowfreq: -16.5409 -6.6509 -0.0009 -0.0004 -0.0001 4.4496 14.2529 19.0145 28.2213
frequency: -15.7083 15.7901 27.9475 42.1315 93.7382 117.4335 151.5828 208.0704 222.9329 270.0303 325.1419 335.0764 372.9130 378.1739 386.6881 402.2883 457.6980 515.6001 549.5755 565.8621 610.7547 633.3575 687.7895 695.9664 724.2394 756.9400 807.8927 828.1107 845.8680 859.6964 896.0380 900.3747 945.4363 965.6970 980.0611 988.2400 991.3070 993.7095 1020.9645 1033.8763 1044.7933 1079.2924 1129.1393 1162.3760 1170.3711 1195.9684 1209.7842 1211.1399 1256.1482 1276.9251 1283.7528 1288.3726 1308.4747 1324.5651 1385.8521 1411.6958 1441.1948 1456.8993 1468.0712 1503.8396 1508.3568 1585.1095 1601.3192 1625.0168 2967.5732 3002.8918 3003.1833 3037.0649 3066.4228 3067.7906 3132.9654 3137.7001 3160.5325 3170.6242 3587.4630
redmass: 8.9002 3.7246 4.2007 5.3483 5.1421 2.4657 7.2674 5.9522 5.3639 6.3982 2.9241 5.9716 4.1368 6.9525 1.1896 2.8322 5.8447 10.9649 5.3555 3.8482 6.1877 7.0306 6.3737 3.5226 4.2695 4.1111 3.2158 1.4059 1.6879 1.3630 4.1607 2.5111 2.9935 1.5393 3.2295 3.2101 4.3453 2.3210 5.0644 3.3871 3.4103 1.6677 1.4428 1.1737 1.1882 1.1698 2.1152 1.1435 1.3629 1.5565 3.1262 1.6784 1.4505 1.4684 5.4875 2.8443 2.0470 1.1618 1.1013 1.1427 2.6353 7.1993 6.6422 6.3165 1.0639 1.0627 1.0644 1.0971 1.1049 1.0991 1.0890 1.0901 1.0962 1.0957 1.0797
irintensity: 0.2299 6.3587 0.6378 0.8864 1.4028 0.8799 3.1222 5.5309 3.6540 3.4065 13.7522 15.6585 8.2909 8.0836 135.8112 0.9827 3.2479 0.3740 5.1016 14.3858 3.5065 1.0584 0.4216 14.1316 2.6434 11.9321 25.8337 0.9985 35.6462 30.0105 5.7149 3.0369 26.2611 16.2912 145.5503 37.7414 135.1348 56.0462 123.0028 72.0751 14.8080 0.7933 1.9805 7.2143 14.0726 11.0853 1.3104 1.1116 10.0182 57.9336 301.3659 47.3565 1.8878 5.0867 1.0764 14.8125 87.6902 12.2901 0.7826 14.8794 0.9846 14.2400 127.0481 25.5224 63.8959 20.2434 49.8649 39.9724 45.0946 3.5370 8.1608 3.1175 5.8392 0.6709 15.6873
temp: 298.150 k
press: 1.00000 atm
elementType: 9 9 9 7 7 6 6 6 6 6 6 6 6 6 6 6 1 1 1 1 1 1 1 1 1 1 1
symmnumber: 1
zpe: 531546.7 jmol-1
zpe.correction: 0.202455 hartree
zpe.thermalcorrener: 0.216163 hartree
zpe.thermalcorrenthalpy: 0.217107 hartree
zpe.thermalcorrgfe: 0.159174 hartree
zpe.sumelectzpe: -833.626483 hartree
zpe.sumelectthermal: -833.612775 hartree
zpe.sumelectthermalent: -833.611831 hartree
zpe.sumelectthermalfe: -833.669764 hartree
dipole: 3.0309 0.2931 2.3684
dipole: 3.8577
quadrupole: -110.0481 -85.8405 -93.5086
quadrupole: -7.7103 9.7432 3.4521
quadrupole: -13.5824 10.6253 2.9571 -7.7103 9.7432 3.4521
hfenergy: -833.8289383 hartree
pointgroup: C01 [X(C11H11F3N2)]
dipole: -1.2349203 0.873021 0.1276947 debye
polarizability: 169.9669746|16.0086697|102.0137731|3.9815336|11.7173331|114.0938665 unknown
InChI: InChI=1S/C11H11F3N2/c12-11(13,14)9-3-1-8(2-4-9)7-10-15-5-6-16-10/h1-4,15H,5-7H2
charge 0 multiplicity 1
27 atoms
F  3.876075 -0.329899 -1.54634
F  3.851855 1.68718 -0.504825
F  4.506821 -0.156551 0.627161
N  -3.113669 1.051641 -0.126369
N  -3.867849 -1.125881 -0.084352
C  -1.967629 -0.572261 1.440373
C  -3.005103 -0.2469 0.387229
C  -4.110795 1.062656 -1.223129
C  -4.733696 -0.377807 -1.066636
C  -0.533339 -0.333175 0.974134
C  -0.065084 -0.920919 -0.229581
C  0.36135 0.459273 1.737506
C  2.138637 0.0718 0.109359
C  1.260706 -0.723654 -0.66268
C  1.689997 0.664255 1.313608
C  3.554939 0.304595 -0.326345
H  -2.114538 -1.635102 1.701279
H  -2.170353 0.021745 2.351488
H  -3.624308 1.201653 -2.209755
H  -4.859531 1.86288 -1.086273
H  -5.763392 -0.331371 -0.666062
H  -4.770632 -0.926257 -2.023508
H  -2.39219 1.763243 -0.020787
H  -0.749003 -1.536807 -0.82463
H  0.017571 0.916019 2.67272
H  1.614356 -1.182328 -1.590789
H  2.371704 1.277874 1.911603
