program: Gaussian 09
title: 000255628
version: EM64L-G09RevD.01
frameworkgroup: C1[X(C16H14ClNO)]
method: RPBEPBE
basis: SDD
operation: Freq
keyword: #p
keyword: freq=noraman
keyword: PBEPBE/SDD
title: #p freq=noraman PBEPBE/SDD
converged: YES YES NO NO
title: Mulliken charges:
elementType: Cl O N C C C C C C C C C C C C C C C C H H H H H H H H H H H H H H
charge: -0.072940 -0.259398 -0.458471 -0.695810 0.328208 0.216183 0.277045 0.174319 -0.565362 -0.434611 0.667959 -0.421792 -0.385724 -0.434230 -0.234783 -0.235251 0.231958 -0.515020 -0.665092 0.251008 0.250864 0.325981 0.265164 0.242917 0.237613 0.226632 0.226783 0.309687 0.242144 0.214562 0.218476 0.216825 0.254158
chargesum: 0.00000
title: Mulliken charges with hydrogens summed into heavy atoms:
elementType: Cl O N C C C C C C C C C C C C C C C C
charge: -0.072940 -0.259398 -0.148784 -0.193938 0.328208 0.216183 0.277045 0.174319 -0.239381 -0.169448 0.667959 -0.178875 -0.148112 -0.434230 -0.008151 -0.008468 0.231958 -0.058314 0.024367
polarizability: 3.48363738e+02 4.82617749e+00 2.02637750e+02 -3.96943664e+00 2.20101735e+00 8.71071668e+01
1716.lowfreq: -0.0025 -0.0025 -0.0015 1.3785 2.8783 5.8816 28.6080 49.7378 58.0516
frequency: 28.6060 49.7169 58.0468 81.6060 92.0067 119.8971 153.1453 186.8555 206.9790 214.3795 226.2371 262.0438 272.7692 305.9514 317.4393 372.7874 395.1805 431.9834 436.3347 464.5753 508.2053 522.6512 561.8370 577.3773 616.2902 635.5954 667.2788 689.2385 696.5397 722.6417 741.2265 744.6441 762.9922 774.5169 799.2246 825.1156 868.9254 873.7373 901.5520 911.9664 947.4913 951.1920 978.2746 987.1378 1004.2815 1022.0601 1026.7463 1072.7820 1078.3293 1100.3759 1132.4493 1143.0808 1169.3799 1181.1352 1187.6871 1202.4447 1215.7351 1242.6164 1260.6256 1292.9809 1317.8209 1333.5717 1363.0618 1386.6337 1390.5199 1424.5765 1433.8513 1443.1250 1451.1069 1455.4422 1473.4860 1485.3677 1488.0289 1500.0281 1582.8076 1590.4834 1621.1532 1621.9408 1624.9644 2980.2944 2985.6153 2995.5328 3029.8630 3033.9039 3091.7443 3106.7399 3122.3436 3128.9636 3142.7807 3161.5138 3162.1558 3178.1048 3487.8959
redmass: 3.1718 3.3298 5.1681 5.7561 4.3784 4.1773 7.0171 3.5117 3.9105 1.4329 4.2496 3.0572 2.6139 4.6372 10.7063 4.8991 6.5972 3.1353 2.9239 5.0110 3.3142 4.5852 3.4438 6.1266 6.3879 3.9098 6.6849 2.4208 1.7749 2.2985 1.9571 4.6102 4.9354 1.8909 1.3881 4.6238 1.3238 1.5712 4.2332 1.6205 1.3899 3.6881 1.7479 1.3575 5.9180 2.0716 2.3304 1.7383 1.9008 2.0029 1.1515 1.9565 1.1421 2.0643 2.3150 1.6988 2.7022 1.2917 1.2642 1.6836 2.9101 1.7554 4.1512 4.6398 1.2054 1.1734 7.5772 2.4457 1.0958 2.6024 1.0494 3.7078 1.0779 2.3400 6.9307 6.4682 5.6293 7.2221 5.7356 1.0593 1.0610 1.0361 1.0992 1.1007 1.1008 1.1004 1.0855 1.0896 1.0946 1.0947 1.0984 1.0933 1.0761
irintensity: 0.3359 0.1831 7.1609 0.1165 3.8498 0.7561 0.6799 1.8599 0.6921 1.2510 1.4851 5.3888 3.7277 9.7178 5.7501 1.0476 2.0181 16.7991 2.8258 9.2607 0.2748 0.9137 0.8241 7.4664 10.9115 0.9066 9.2900 11.0789 30.3588 50.0222 10.2588 10.7827 0.2496 62.5706 15.3289 2.7279 1.5148 13.8104 28.1324 4.3832 2.3548 7.1563 27.8301 1.9253 18.5900 1.2042 14.4306 9.2532 9.1536 7.3868 0.0189 1.3741 0.0940 9.5544 123.5980 11.8252 5.5812 9.7529 4.2668 19.4408 24.3940 24.0729 121.3924 28.7072 23.0049 10.6767 39.7922 56.7934 14.3477 34.3540 21.4280 11.9293 42.3497 548.1588 94.4666 5.6693 77.4394 9.4163 27.6410 21.3438 10.4252 40.0422 5.9903 15.7758 41.4423 20.8004 4.6042 2.3214 29.5763 7.2904 35.1702 9.5234 44.0218
temp: 298.150 k
press: 1.00000 atm
elementType: 17 8 7 6 6 6 6 6 6 6 6 6 6 6 6 6 6 6 6 1 1 1 1 1 1 1 1 1 1 1 1 1 1
symmnumber: 1
zpe: 675114.5 jmol-1
zpe.correction: 0.257138 hartree
zpe.thermalcorrener: 0.273657 hartree
zpe.thermalcorrenthalpy: 0.274601 hartree
zpe.thermalcorrgfe: 0.211893 hartree
zpe.sumelectzpe: -1206.849417 hartree
zpe.sumelectthermal: -1206.832898 hartree
zpe.sumelectthermalent: -1206.831954 hartree
zpe.sumelectthermalfe: -1206.894662 hartree
dipole: -0.0999 1.0248 -0.0386
dipole: 1.0304
quadrupole: -96.6343 -116.9880 -122.2156
quadrupole: 7.9453 -0.7737 -0.0140
quadrupole: 15.3117 -5.0420 -10.2697 7.9453 -0.7737 -0.0140
hfenergy: -1207.1065549 hartree
pointgroup: C01 [X(C16H14Cl1N1O1)]
dipole: -0.0512497 0.4017851 0.0169209 debye
polarizability: 347.8751619|9.566139|202.0127294|-5.3335333|11.0839142|88.2207628 unknown
InChI: InChI=1S/C16H14ClNO/c1-2-16(19)18-15-8-11-7-10-5-3-4-6-12(10)13(11)9-14(15)17/h3-6,8-9,18H,2,7H2,1H3
charge 0 multiplicity 1
33 atoms
Cl 1.858382 3.237371 0.234305
O  3.584258 -1.787105 -0.361584
N  3.040494 0.485318 -0.107692
C  -1.526966 -1.850689 -0.205123
C  -0.524964 -0.706463 -0.113474
C  -1.218404 0.531065 0.045247
C  -2.87018 -1.139007 -0.082463
C  -2.667521 0.268661 0.065251
C  0.873888 -0.762902 -0.166783
C  -0.492919 1.737904 0.152558
C  1.625069 0.444918 -0.061767
C  -4.170096 -1.67303 -0.098898
C  -3.768768 1.143601 0.19731
C  0.906661 1.666773 0.09646
C  -5.275638 -0.794791 0.033491
C  -5.074482 0.60077 0.180286
C  3.939016 -0.574718 -0.261339
C  5.410849 -0.147255 -0.330028
C  6.324331 -1.11376 0.454849
H  -1.375861 -2.594836 0.601164
H  -1.434486 -2.401539 -1.161511
H  1.421931 -1.699746 -0.285647
H  -0.989705 2.704327 0.275683
H  -4.333238 -2.751044 -0.211978
H  -3.621976 2.223809 0.310717
H  -6.29491 -1.196749 0.022636
H  -5.940784 1.264096 0.281292
H  3.445379 1.423071 -0.021019
H  5.703384 -0.158497 -1.399258
H  5.543784 0.892624 0.026069
H  6.130261 -1.054706 1.5405
H  7.387678 -0.874026 0.278902
H  6.135629 -2.151349 0.132544
