program: Gaussian 09
title: 000255615
version: EM64L-G09RevD.01
frameworkgroup: C1[X(C10H10F2N2O2)]
method: RPBEPBE
basis: SDD
operation: Freq
keyword: #p
keyword: freq=noraman
keyword: PBEPBE/SDD
title: #p freq=noraman PBEPBE/SDD
converged: NO YES NO NO
title: Mulliken charges:
elementType: F F O O N N C C C C C C C C C C H H H H H H H H H H
charge: -0.198033 -0.174359 -0.226624 -0.249580 -0.452888 -0.452420 0.107202 0.628040 0.259141 0.346216 -0.527124 -0.661953 0.228047 0.224292 -0.770728 -0.797042 0.339211 0.253206 0.318915 0.321025 0.258618 0.258471 0.215622 0.239940 0.272638 0.240164
chargesum: 0.00000
title: Mulliken charges with hydrogens summed into heavy atoms:
elementType: F F O O N N C C C C C C C C C C
charge: -0.198033 -0.174359 -0.226624 -0.249580 -0.133973 -0.131395 0.107202 0.628040 0.259141 0.346216 -0.187912 -0.408746 0.228047 0.224292 -0.038017 -0.044300
polarizability: 2.23882626e+02 1.66699906e+00 1.25876467e+02 -2.59450913e+00 -3.24296589e+00 7.20178869e+01
1716.lowfreq: -79.7168 -5.5134 -2.2037 -0.0008 -0.0007 -0.0006 6.8241 38.4371 53.9469
frequency: -79.6849 38.3787 53.9105 62.1875 73.8835 89.1355 95.9852 138.9653 167.3270 235.9468 247.3278 251.3415 271.2725 282.1981 291.7051 363.6816 394.9006 479.1933 494.8668 532.8512 551.4842 555.0093 568.9111 572.5777 586.0446 611.2343 628.0757 653.9937 710.8906 717.9775 819.5680 849.9534 902.7799 912.0162 921.5688 959.6727 982.0969 1000.4138 1015.9266 1032.6091 1039.4972 1131.8683 1199.4079 1215.4254 1232.0488 1251.2484 1339.5190 1364.4824 1378.5513 1386.9942 1423.5159 1446.4826 1449.7397 1458.0958 1467.6270 1468.4095 1512.0659 1517.8240 1595.7126 1636.3357 1638.1213 1648.9359 2989.2618 2996.7443 3074.3261 3088.4742 3115.7895 3138.4849 3158.0811 3201.7219 3529.3775 3541.7934
redmass: 1.0372 4.8418 1.4151 5.9393 2.7711 4.1548 4.4275 6.0993 10.0233 6.5203 5.0939 4.9953 11.3248 4.6644 5.6877 4.9058 4.7847 4.9782 7.2638 4.5258 2.2441 1.9840 4.4731 3.2103 3.6701 4.6971 1.8503 1.7923 4.6483 4.3156 4.9239 1.6591 1.4643 6.4690 4.4457 2.5530 2.2636 3.5154 2.0995 1.6636 1.6618 2.3081 1.4677 2.9074 2.7146 2.3041 3.7648 5.1315 1.2442 1.2238 4.5250 1.2545 1.1410 1.6312 1.0467 1.0985 2.4262 3.7899 5.7797 5.1379 7.1945 8.4178 1.0385 1.0368 1.0983 1.0986 1.0994 1.0979 1.0926 1.0936 1.0767 1.0770
irintensity: 0.0612 0.4512 3.7161 17.4785 6.3600 3.9076 2.1271 2.6308 1.8600 0.0745 0.1058 1.6938 0.6696 3.0627 5.8608 0.8344 11.9255 4.7311 3.0877 15.4497 38.7801 70.7674 9.6756 2.0012 12.0411 11.8420 47.9828 19.3476 8.6610 3.0486 2.2210 36.0141 54.6107 6.8834 2.6261 21.9554 36.8101 63.9151 30.5925 8.4508 27.3989 15.0844 3.8282 114.3651 153.2984 51.9526 165.8390 262.7960 71.3905 45.8161 83.7568 42.0217 11.5948 77.7745 20.3399 16.6175 557.1213 132.6213 113.2907 110.7850 167.3596 80.1106 6.9853 10.7980 13.3566 14.8861 11.2306 6.0997 2.2240 24.5952 16.2632 27.3683
temp: 298.150 k
press: 1.00000 atm
elementType: 9 9 8 8 7 7 6 6 6 6 6 6 6 6 6 6 1 1 1 1 1 1 1 1 1 1
symmnumber: 1
zpe: 494977.8 jmol-1
zpe.correction: 0.188527 hartree
zpe.thermalcorrener: 0.203784 hartree
zpe.thermalcorrenthalpy: 0.204728 hartree
zpe.thermalcorrgfe: 0.144867 hartree
zpe.sumelectzpe: -845.555448 hartree
zpe.sumelectthermal: -845.540191 hartree
zpe.sumelectthermalent: -845.539247 hartree
zpe.sumelectthermalfe: -845.599108 hartree
dipole: -1.8162 -1.6349 -2.2916
dipole: 3.3501
quadrupole: -72.1036 -95.8319 -95.3851
quadrupole: 27.1740 -7.6977 0.4069
quadrupole: 15.6699 -8.0583 -7.6116 27.1740 -7.6977 0.4069
hfenergy: -845.7439751 hartree
pointgroup: C01 [X(C10H10F2N2O2)]
dipole: -0.6882399 -0.5365018 -0.9877574 debye
dipolederiv: -0.2976164 -0.2006599 -0.0274109 -0.2148376 -0.9037695 -0.1172852 -0.0196557 -0.1240824 -0.1575658 -0.5371388 0.2927317 0.1729596 0.3312656 -0.537737 -0.2003284 0.1278854 -0.1870727 -0.2081523 -0.6509248 -0.0808866 0.0454311 0.3770959 -0.6527319 0.3657031 -0.2917865 0.2575439 -0.5911629 -0.7356567 -0.050763 0.0258938 0.5801836 -0.8619935 -0.1379926 0.1514533 -0.0887894 -0.3594669 -1.6233721 0.1055152 -0.2507298 0.2230437 -0.3247605 0.072795 -0.4228579 0.0914985 -0.5367057 -2.0759264 0.0919455 0.1545291 0.2402238 -0.3606797 -0.0317927 0.2348797 -0.0142644 -0.3537028 0.7388471 0.1541894 0.0505951 0.3930613 -0.2468262 0.0366228 0.0138543 -0.0186737 -0.0164924 1.3082246 0.1192598 -0.0851704 0.4547526 0.2574548 -0.0153666 -0.0680462 0.0028849 0.1343076 0.434866 0.1355239 -0.0230826 0.2527368 1.0480437 0.1347867 -0.08595 0.1494377 0.1194213 0.7464256 -0.2076257 -0.1965028 -0.4320852 0.7109578 0.2539786 -0.0541945 0.2175743 0.228639 -0.4433018 -0.1245127 -0.0058874 -0.2427954 -0.2630286 0.009771 -0.0315571 0.004061 -0.189416 -0.5449946 0.0346945 0.0402818 0.0862247 -0.0816037 0.0155426 0.0750696 0.012181 -0.2369332 1.778643 -0.0106817 0.254973 -0.787071 0.7379329 -0.6299472 0.5533908 -0.4661172 0.7249451 1.9699751 -0.0603871 -0.1734977 -0.9013013 1.0853519 0.2326433 -0.3647148 0.1718985 0.2354642 -0.4733627 -0.1366951 0.0422458 -0.0342855 0.0235499 0.0039167 0.0972857 0.0211656 -0.0067847 -0.3930968 -0.1555135 0.0167893 -0.2903201 -0.1437439 -0.0075418 -0.007876 -0.0203568 0.0497608 0.2030059 0.0491611 0.0088626 -0.0059287 0.1154595 -0.019499 0.007753 -0.0130172 0.2023869 0.0593696 -0.0637511 -0.005781 -0.0622894 -0.0103199 -0.0426157 0.0036613 -0.034761 0.1845555 0.1026172 -0.0093059 -0.0380158 0.0424728 0.1669332 0.0705222 0.0731887 0.0425491 0.3119495 0.1673367 0.0227128 0.0194109 -0.0073055 0.1129467 -0.0323632 0.015557 -0.0367076 0.298769 0.0267234 0.0250988 0.0483389 0.0361605 0.0209991 -0.0773903 0.0886784 -0.0589204 0.0550112 0.0698451 -0.0189965 -0.0560881 -0.038732 0.1054156 0.0172668 -0.1130337 -0.013215 -0.0391878 0.0651544 0.0405392 -0.0208951 -0.048379 -0.1047141 0.0997325 0.0098043 0.1052069 0.069492 0.0582039 -0.0164167 0.0226008 -0.0396831 0.0714626 -0.0786973 -0.033411 -0.0893371 -0.0640965 -0.0084528 0.0414169 0.0241822 0.1085699 0.041658 -0.0302809 0.0390815 -0.0220629 0.1247943 0.0546063 0.0234067 -0.0440325 -0.0207771 -0.0062572 0.1078195 0.0015403 0.1113763 0.0201705 unknown
polarizability: 223.4309582|6.9580703|126.0843914|-2.5237865|4.7416738|72.2616299 unknown
InChI: InChI=1S/C10H10F2N2O2/c1-5(15)13-7-3-8(11)10(9(12)4-7)14-6(2)16/h3-4,13-14H,1-2H3
charge 0 multiplicity 1
26 atoms
F  0.595279 2.612245 0.235852
F  1.739634 -1.927896 -0.916791
O  3.420952 -0.919565 1.113755
O  -4.011451 1.166674 0.419232
N  2.598356 0.759752 -0.292012
N  -2.879309 -0.83169 -0.06676
C  1.241015 0.353067 -0.260931
C  -1.532211 -0.390507 -0.133308
C  0.203989 1.275032 0.017211
C  0.80447 -0.969015 -0.517492
C  -1.15636 0.962651 0.08008
C  -0.538249 -1.357858 -0.43991
C  3.630304 0.097944 0.402234
C  -4.031808 -0.077423 0.198601
C  5.016443 0.697076 0.190988
C  -5.317446 -0.902276 0.195005
H  -1.904426 1.724534 0.302089
H  -0.793417 -2.403541 -0.640483
H  2.794403 1.685454 -0.678556
H  -3.023414 -1.831103 -0.229205
H  5.600603 0.019631 -0.458126
H  5.534265 0.749082 1.162011
H  5.006797 1.698334 -0.273372
H  -5.493165 -1.368193 -0.792403
H  -6.160765 -0.236125 0.425333
H  -5.282189 -1.705883 0.953755
