program: Gaussian 09
title: 000255601
version: EM64L-G09RevD.01
frameworkgroup: C1[X(C14H14N4O)]
method: RPBEPBE
basis: SDD
operation: Freq
keyword: #p
keyword: freq=noraman
keyword: PBEPBE/SDD
title: #p freq=noraman PBEPBE/SDD
converged: YES YES NO NO
title: Mulliken charges:
elementType: O N N N N C C C C C C C C C C C C C C H H H H H H H H H H H H H H
charge: -0.238357 -0.424423 -0.372137 -0.041848 -0.033704 0.439129 0.171164 -0.437392 -0.783696 0.489157 0.009169 -0.378485 -0.391316 -0.306969 -0.231841 -0.231229 -0.237851 -0.202056 -0.284397 0.351192 0.250975 0.240404 0.254736 0.240449 0.326061 0.223504 0.229373 0.215763 0.228877 0.231074 0.233555 0.240088 0.221029
chargesum: 0.00000
title: Mulliken charges with hydrogens summed into heavy atoms:
elementType: O N N N N C C C C C C C C C C C C C C
charge: -0.238357 -0.073231 -0.046076 -0.041848 -0.033704 0.439129 0.171164 -0.186417 -0.048107 0.489157 0.009169 -0.154981 -0.161943 -0.091206 -0.002964 -0.000155 -0.004296 0.038032 -0.063368
polarizability: 5.23150277e+02 2.18089654e+01 1.85729115e+02 4.19460858e-01 -4.05003113e-01 7.59510662e+01
1716.lowfreq: -9.9016 -2.6085 -0.0006 -0.0001 0.0007 1.2809 25.8501 28.1606 31.8449
frequency: 25.8020 28.1590 31.7984 73.7992 103.3405 111.6275 132.9143 151.5143 177.0301 183.9393 205.4549 233.5529 234.4421 301.2238 321.3969 358.9023 385.1363 403.3443 418.0270 486.3078 512.0591 519.2706 550.7621 552.0210 604.7261 608.8090 609.6500 617.6507 667.5177 693.6300 721.0024 721.6279 740.2093 767.7975 837.2570 843.9327 864.8563 874.6554 874.9677 916.7915 925.4607 953.5408 978.5860 985.6899 987.3296 1000.2808 1007.0658 1026.0881 1043.7422 1052.2155 1082.7710 1103.3802 1148.6959 1173.8901 1187.3267 1191.9168 1214.1448 1235.5958 1259.1451 1275.9593 1297.1304 1317.1995 1340.2160 1378.9074 1387.0848 1404.8322 1437.7798 1455.0054 1462.0345 1465.5596 1481.9795 1486.2233 1554.9236 1560.8614 1581.3736 1608.7680 1622.0600 1633.6698 1654.3177 2979.5624 3005.0433 3055.6120 3083.1190 3115.4285 3120.3150 3127.3686 3132.7122 3141.0009 3151.8248 3167.4953 3186.5990 3439.8381 3487.8088
redmass: 3.7343 7.0865 5.4299 5.2054 4.9700 1.3673 2.9664 3.6908 2.5612 7.1091 2.8660 5.8459 5.3299 3.4467 2.9950 4.3209 5.6321 2.7840 6.0100 6.3318 2.9041 4.8602 3.9580 8.0266 6.1838 1.2316 4.5785 5.7201 3.0836 1.6939 5.3263 1.4086 3.7781 1.7267 4.5700 1.3007 1.4666 5.5484 1.6478 1.5757 1.5138 2.3115 1.3842 1.1791 6.0765 1.2898 4.0316 2.1945 2.1750 1.5291 1.6614 4.7973 3.0676 1.0840 2.1820 1.1244 1.7712 1.6636 1.6449 1.6352 1.6531 1.4842 1.3233 2.6349 5.6581 1.3921 2.4655 2.1821 1.7876 1.0434 1.9692 2.0891 5.2993 6.6124 5.4950 5.9643 5.7434 5.0665 6.7891 1.0390 1.0888 1.0979 1.0896 1.0970 1.0876 1.0867 1.0892 1.0909 1.0960 1.1015 1.0936 1.0766 1.0777
irintensity: 0.7385 2.8922 1.6423 0.1016 8.6923 0.2564 3.0142 0.9066 3.8069 2.2439 6.6010 4.9255 10.6165 11.5471 6.5167 3.8079 7.5240 0.0010 3.5600 4.4325 11.2690 7.8540 0.7283 0.9686 18.6186 114.3778 2.4066 0.6522 0.5939 44.8413 4.3034 83.8183 0.0182 68.9569 10.3473 0.0153 33.2238 57.6475 2.9459 2.9580 0.0175 8.9413 0.7598 75.4912 0.4242 18.7495 11.9695 2.6706 56.7647 10.3768 17.9017 338.0315 20.3611 1.3436 2.5524 4.2788 57.1813 20.8608 93.8142 22.1521 17.0205 11.0777 10.6856 44.8198 1.0045 36.6353 25.5078 392.2704 0.8657 17.6513 158.2199 48.6812 1494.9193 71.9653 0.3886 1.4207 236.6457 51.6764 412.6744 18.0785 40.5582 15.8054 18.6019 12.7971 8.4903 9.0479 13.9744 3.6546 39.0193 38.3973 4.2871 26.7314 106.4093
temp: 298.150 k
press: 1.00000 atm
elementType: 8 7 7 7 7 6 6 6 6 6 6 6 6 6 6 6 6 6 6 1 1 1 1 1 1 1 1 1 1 1 1 1 1
symmnumber: 1
zpe: 673637.4 jmol-1
zpe.correction: 0.256575 hartree
zpe.thermalcorrener: 0.273760 hartree
zpe.thermalcorrenthalpy: 0.274704 hartree
zpe.thermalcorrgfe: 0.209415 hartree
zpe.sumelectzpe: -834.748831 hartree
zpe.sumelectthermal: -834.731646 hartree
zpe.sumelectthermalent: -834.730702 hartree
zpe.sumelectthermalfe: -834.795991 hartree
dipole: 8.7064 4.3349 0.0374
dipole: 9.7259
quadrupole: -148.5415 -97.0205 -117.4838
quadrupole: -31.3564 -0.1429 -0.1501
quadrupole: -27.5263 23.9948 3.5315 -31.3564 -0.1429 -0.1501
hfenergy: -835.0054058 hartree
pointgroup: C01 [X(C14H14N4O1)]
dipole: 3.1037677 -0.7403454 2.1119754 debye
polarizability: 507.2824125|-21.4217923|89.6547654|71.574642|-39.1220542|187.8932813 unknown
InChI: InChI=1S/C14H14N4O/c1-11-10-13(19)17-14(16-11)18-15-9-5-8-12-6-3-2-4-7-12/h2-10,16,18H,1H3
charge 0 multiplicity 1
33 atoms
O  -6.437003 1.194499 -2.613544
N  -3.34482 0.307858 -0.088243
N  -1.828139 0.939006 -1.775983
N  -4.116703 1.082054 -2.238693
N  -0.815433 0.632997 -0.894576
C  -4.649637 0.117108 0.390345
C  -3.159473 0.780213 -1.379983
C  -5.698453 0.412063 -0.451802
C  -4.774765 -0.401135 1.800953
C  4.035837 0.345735 0.043752
C  -5.483356 0.917722 -1.82864
C  3.959365 -0.118892 1.391452
C  5.328901 0.545771 -0.523987
C  2.853984 0.625907 -0.778559
C  5.128709 -0.371464 2.133337
C  6.499635 0.292488 0.21939
C  6.40561 -0.168139 1.553149
C  1.534452 0.485268 -0.410743
C  0.438145 0.790681 -1.298805
H  -2.503715 0.116235 0.46663
H  -6.730643 0.278446 -0.120496
H  -4.284017 -1.386922 1.911412
H  -5.835094 -0.51506 2.072911
H  -4.306408 0.290924 2.526549
H  -1.680736 1.285917 -2.73357
H  2.982644 -0.281735 1.860274
H  5.407411 0.903217 -1.558419
H  3.062666 0.986314 -1.797836
H  5.05097 -0.727557 3.166695
H  7.482127 0.453258 -0.237723
H  7.312603 -0.366439 2.134523
H  1.256862 0.1290 0.588734
H  0.677673 1.156465 -2.315699
