program: Gaussian 09
title: 000255598
version: EM64L-G09RevD.01
frameworkgroup: C1[X(C13H18N2)]
method: RPBEPBE
basis: SDD
operation: Freq
keyword: #pfreq=noraman
keyword: PBEPBE/SDD
title: #p freq=noraman PBEPBE/SDD
converged: YES YES NO NO
title: Mulliken charges:
elementType: N N C C C C C C C C C C C C C H H H H H H H H H H H H H H H H H H
charge: -0.049187 -0.049206 -0.321711 -0.450835 -0.450868 -0.460759 -0.460755 -0.402112 0.417022 -0.408217 -0.408291 -0.388301 -0.386741 0.434542 -0.811234 0.261145 0.253273 0.215477 0.215480 0.253282 0.235896 0.217288 0.217292 0.235896 0.208688 0.209916 0.271367 0.271318 0.225614 0.225586 0.223191 0.232676 0.223268
chargesum: 0.00000
title: Mulliken charges with hydrogens summed into heavy atoms:
elementType: N N C C C C C C C C C C C C C
charge: -0.049187 -0.049206 -0.060566 0.017915 0.017894 -0.007575 -0.007567 0.016492 0.417022 -0.136850 -0.136972 -0.162687 -0.161155 0.434542 -0.132099
polarizability: 1.96635894e+02 -1.85254149e-02 1.36758409e+02 8.22726353e+00 2.59216350e-03 1.03520358e+02
1716.lowfreq: -42.4298 -15.5819 -12.8177 -0.0004 0.0002 0.0003 15.3316 50.3426 60.1908
frequency: -41.9330 50.2380 60.0054 114.3378 154.3516 210.0140 220.0662 282.6873 286.1262 315.8506 354.5566 408.4874 410.3510 420.4633 488.0236 496.8356 519.2113 596.5674 634.9028 675.7710 714.9054 727.8106 759.3641 771.4320 816.1854 821.5994 826.0989 843.3484 860.6571 862.5675 865.3154 891.4959 924.8095 954.2455 971.1286 978.7473 986.0378 986.8529 993.1600 1017.5629 1043.7297 1046.6711 1066.1801 1102.1478 1114.6076 1130.1294 1176.7392 1176.9340 1183.9726 1217.8983 1219.3647 1226.1392 1253.8831 1267.7873 1273.8839 1290.3837 1294.5822 1299.4917 1322.0779 1324.2378 1330.0323 1333.0673 1368.5763 1395.4459 1400.7554 1455.7980 1459.7731 1466.1867 1466.7941 1471.8892 1472.1789 1482.8749 1503.4886 1582.2316 1624.1439 2972.2730 2981.3014 2993.2081 2994.1171 3009.9520 3018.3989 3028.1278 3034.7872 3052.9686 3053.7075 3063.4722 3075.4143 3081.4223 3098.0744 3113.5399 3115.8597 3146.1759 3150.7546
redmass: 1.0200 3.6392 3.5831 3.8314 3.5419 1.9222 2.8570 2.8621 2.9171 3.7767 2.2391 2.2110 2.9535 3.1197 3.7668 2.7838 2.9240 2.6345 6.9268 5.3914 3.4722 3.9340 2.0032 2.3981 2.0376 3.7868 1.7549 3.0896 1.6190 3.5464 1.2469 3.3037 2.3632 2.4500 2.1432 2.1170 1.7614 2.0281 1.3598 2.6670 2.2525 1.5607 2.5348 1.8519 1.4092 2.6152 1.1381 1.1531 1.3047 3.0233 1.7910 1.7426 1.3689 1.1269 1.2624 1.3089 1.3370 1.2837 1.5627 1.1769 1.3428 1.2798 5.6073 1.2260 3.2812 1.0895 1.0835 1.0858 1.0811 1.0862 1.0599 1.0891 2.7972 6.5241 6.4556 1.0384 1.0597 1.0600 1.0658 1.0828 1.0585 1.0635 1.0969 1.0950 1.1044 1.1050 1.1072 1.0997 1.1081 1.0888 1.0887 1.0941 1.0956
irintensity: 0.4518 0.0073 1.4710 1.6044 0.7043 0.3085 0.0384 0.7941 0.3311 0.9461 0.1770 3.7352 0.0003 7.4788 0.4888 18.8113 0.9878 1.0036 0.7928 25.0325 0.5396 9.1853 8.6557 4.2673 31.2721 21.7878 9.1614 5.9706 4.6161 8.4779 0.0185 8.6336 16.3569 1.8019 41.0358 0.0115 1.4577 11.7959 0.2543 4.6699 0.4260 19.4445 59.6269 2.2245 5.4712 6.8547 16.8388 5.1317 7.5409 0.1367 5.8312 0.4306 1.9700 2.3066 0.0115 16.8320 0.1227 1.1297 43.5837 0.1681 2.7947 3.9046 0.3658 9.4968 2.9376 2.9752 0.0093 13.6637 21.7708 16.6190 13.0197 24.7445 34.0511 0.0594 1.4604 44.3098 28.0369 55.5144 33.5817 35.9010 25.1256 44.1136 47.5688 25.2590 17.0150 74.2072 1.8256 18.3981 65.3208 20.7637 19.1002 15.7927 2.2719
temp: 298.150 k
press: 1.00000 atm
elementType: 7 7 6 6 6 6 6 6 6 6 6 6 6 6 6 1 1 1 1 1 1 1 1 1 1 1 1 1 1 1 1 1 1
symmnumber: 1
zpe: 748263.0 jmol-1
zpe.correction: 0.284998 hartree
zpe.thermalcorrener: 0.297208 hartree
zpe.thermalcorrenthalpy: 0.298152 hartree
zpe.thermalcorrgfe: 0.246598 hartree
zpe.sumelectzpe: -614.526048 hartree
zpe.sumelectthermal: -614.513839 hartree
zpe.sumelectthermalent: -614.512895 hartree
zpe.sumelectthermalfe: -614.564449 hartree
dipole: -1.6124 -0.0016 0.5160
dipole: 1.6930
quadrupole: -76.4315 -92.0434 -89.3627
quadrupole: -0.0076 1.3344 0.0045
quadrupole: 9.5144 -6.0975 -3.4169 -0.0076 1.3344 0.0045
hfenergy: -614.8110465 hartree
pointgroup: C01 [X(C13H18N2)]
dipole: -0.6376407 0.000673 -0.1925141 debye
polarizability: 196.3395013|0.0175217|136.7584071|-9.7569909|0.0052179|103.8167522 unknown
InChI: InChI=1S/C13H18N2/c1-11-3-5-12(6-4-11)13-14-7-2-8-15(13)10-9-14/h3-6,13H,2,7-10H2,1H3
charge 0 multiplicity 1
33 atoms
N  -1.591695 1.193654 0.004692
N  -1.591844 -1.193494 0.005473
C  -0.898414 0.000229 0.615275
C  -1.654489 0.795562 -1.447774
C  -1.654606 -0.796349 -1.447248
C  -2.96479 1.285504 0.612411
C  -2.964945 -1.284792 0.613262
C  -3.823197 0.000335 0.397156
C  0.605693 0.00007 0.347029
C  1.319367 -1.218686 0.254963
C  1.319631 1.218759 0.255261
C  2.719737 -1.215844 0.073675
C  2.719939 1.215716 0.074033
C  3.445506 -0.000149 -0.021274
C  4.949239 -0.000109 -0.242004
H  -1.076834 0.000602 1.707119
H  -0.757892 1.178795 -1.962789
H  -2.548145 1.233317 -1.923839
H  -2.548332 -1.234292 -1.923011
H  -0.758075 -1.180049 -1.962031
H  -3.478237 2.167523 0.189439
H  -2.824532 1.477466 1.693342
H  -2.824706 -1.476059 1.694318
H  -3.478495 -2.167029 0.190872
H  -4.693378 0.000617 1.082113
H  -4.231884 0.000019 -0.632046
H  0.75815 -2.157264 0.320854
H  0.758565 2.157417 0.32131
H  3.258888 -2.169411 0.006369
H  3.259273 2.169213 0.007019
H  5.422042 -0.89837 0.193322
H  5.195157 0.009367 -1.322096
H  5.424404 0.889032 0.209306
