program: Gaussian 09
title: 000255582
version: EM64L-G09RevD.01
frameworkgroup: C1[X(C8H6ClNO3)]
method: RPBEPBE
basis: SDD
operation: Freq
keyword: #p
keyword: freq=noraman
keyword: PBEPBE/SDD
title: #p freq=noraman PBEPBE/SDD
converged: YES YES NO NO
title: Mulliken charges:
elementType: Cl O O O N C C C C C C C C H H H H H H
charge: -0.006108 -0.185984 -0.194175 -0.187494 0.018597 0.270666 0.227575 -0.299998 -0.338870 0.121743 -0.125716 -0.184779 -0.728526 0.293642 0.293686 0.271945 0.239812 0.275238 0.238747
chargesum: 0.00000
title: Mulliken charges with hydrogens summed into heavy atoms:
elementType: Cl O O O N C C C C C C C C
charge: -0.006108 -0.185984 -0.194175 -0.187494 0.018597 0.270666 0.227575 -0.006355 -0.045185 0.121743 -0.125716 0.087165 0.025272
polarizability: 1.68574041e+02 -2.86674972e+00 1.29477464e+02 -6.81289199e-01 -5.89362280e+00 5.78125145e+01
1716.lowfreq: -5.3391 -0.0023 -0.0017 -0.0015 7.6891 10.8050 16.6355 65.6493 81.3293
frequency: 15.9465 65.6426 81.3195 97.7067 118.6162 163.0571 190.7709 250.6032 295.1779 309.7453 328.4134 352.7332 436.5907 485.9952 511.9002 554.3914 606.8951 618.2046 659.3789 666.1252 737.5235 746.7398 814.5017 840.9419 894.5423 972.3679 978.5815 1010.7423 1041.8598 1081.8036 1098.7030 1143.7128 1211.5138 1224.2543 1259.7984 1355.0005 1375.5918 1383.6665 1395.6633 1441.8810 1445.6934 1454.1264 1566.0676 1590.6911 1607.5287 2988.8773 3086.4063 3131.3048 3172.4547 3173.0348 3189.5864
redmass: 4.5800 1.5951 7.1554 3.2372 5.6223 8.8016 4.2421 6.3067 14.1770 5.0063 6.0917 6.9687 3.5819 6.6373 5.0447 4.8173 5.1289 3.7239 5.6273 6.7557 4.8926 7.6408 7.6605 1.4260 1.4281 2.1781 1.3660 1.6651 4.0012 2.9002 2.0795 1.6414 7.4155 3.3767 1.4047 6.4531 1.3031 3.8684 7.8871 1.3158 1.4243 1.2756 7.0390 8.4191 9.8055 1.0410 1.0908 1.1021 1.0896 1.0926 1.0977
irintensity: 3.0147 1.0733 2.6227 2.8114 1.3362 1.1744 7.1575 1.1492 1.6364 0.8334 0.1946 4.4362 3.8454 18.1111 25.6365 1.4026 2.9786 1.5178 10.7877 11.0205 3.2586 2.4223 55.2410 36.9696 21.2657 12.2764 1.6842 8.2786 2.1613 53.6533 6.0394 8.1918 188.4561 253.4285 35.6730 159.6897 38.3779 24.9974 19.9507 18.2280 18.7983 9.8568 107.8969 28.9869 103.7261 2.2973 7.2570 10.0959 1.9155 0.7071 1.7010
temp: 298.150 k
press: 1.00000 atm
elementType: 17 8 8 8 7 6 6 6 6 6 6 6 6 1 1 1 1 1 1
symmnumber: 1
zpe: 330315.1 jmol-1
zpe.correction: 0.125810 hartree
zpe.thermalcorrener: 0.138016 hartree
zpe.thermalcorrenthalpy: 0.138961 hartree
zpe.thermalcorrgfe: 0.085134 hartree
zpe.sumelectzpe: -1047.907260 hartree
zpe.sumelectthermal: -1047.895054 hartree
zpe.sumelectthermalent: -1047.894109 hartree
zpe.sumelectthermalfe: -1047.947936 hartree
dipole: -3.0054 -0.9847 2.6445
dipole: 4.1225
quadrupole: -90.2101 -83.3173 -82.8775
quadrupole: 6.6762 4.7293 6.7376
quadrupole: -4.7418 2.1510 2.5908 6.6762 4.7293 6.7376
hfenergy: -1048.03307 hartree
pointgroup: C01 [X(C8H6Cl1N1O3)]
dipole: 1.2323111 0.3663921 0.9888394 debye
dipolederiv: -0.8952777 0.1446679 0.0318392 0.2055861 -0.1362957 -0.008434 0.0214446 -0.0120856 -0.0374356 -0.4216161 -0.1226032 0.102031 -0.1879587 -0.746022 -0.2133517 0.0661047 -0.1513455 -0.6452617 -0.5619583 0.1862133 0.0074521 0.2473652 -0.8326419 -0.1009908 0.0057883 -0.1170413 -0.2313039 -0.7647303 -0.130708 -0.071226 -0.1384189 -0.6678463 -0.0672774 -0.0693266 -0.0692194 -0.2331729 1.6636185 -0.180442 0.0774321 -0.2656451 1.2211838 0.2258852 0.0833121 0.2072292 0.2205199 0.0682083 -0.1526482 0.0288001 -0.4699678 -0.0765115 -0.0053312 -0.0135305 0.0294088 -0.061735 -0.7145301 0.2346891 0.0003859 0.2221655 -0.0180341 -0.0473837 0.0528332 0.04033 0.0422146 -0.5765083 -0.0559618 0.0131852 -0.1552047 -0.0349064 0.0085869 -0.0436359 0.006807 -0.0729953 0.2479815 -0.2162481 -0.0058955 0.1352791 -0.0625308 0.0049718 0.0418654 0.0066371 -0.0788866 0.6750581 0.3690103 -0.3229717 0.5171967 1.0517788 0.1313154 -0.256178 -0.0174472 0.855452 1.4255161 -0.2438992 -0.0576181 -0.2684928 0.3257128 0.0174552 -0.0381425 0.027767 -0.0292462 -0.3374218 0.2740377 0.0149119 0.2910685 -0.1688511 -0.0002524 0.0271585 -0.0111147 -0.0976772 -0.1815242 -0.1273969 0.2104876 -0.16623 -0.0768704 0.1537752 0.203419 0.1189387 -0.296684 0.0966639 0.0072356 -0.0025298 0.0320409 0.0374309 -0.0012675 0.0246525 0.0004479 0.1489391 0.1056027 0.0448721 0.0026023 -0.0024917 0.0580621 0.0005987 -0.0187675 -0.004572 0.169685 0.0303776 -0.0548165 -0.001677 -0.0492258 0.05383 -0.0023432 -0.0019287 -0.0007028 0.1650036 0.0646802 0.0986741 -0.048257 0.0604181 0.025706 0.0602101 -0.0168783 0.0575449 0.0441547 -0.0183759 -0.0652341 -0.0021396 -0.0370803 0.1075088 -0.0374467 -0.0424659 -0.0240598 0.0794259 0.0942359 -0.009442 0.0231872 0.0295959 -0.0607029 -0.11872 -0.0257243 -0.0875223 0.0590036 unknown
polarizability: 168.3429225|-3.0779422|129.4839837|-4.1753033|6.4490432|58.0371132 unknown
InChI: InChI=1S/C8H6ClNO3/c1-5(11)7-4-6(9)2-3-8(7)10(12)13/h2-4H,1H3
charge 0 multiplicity 1
19 atoms
Cl 4.15201 -0.459882 -0.122585
O  -0.90776 -2.648755 -0.919641
O  -1.963651 2.405117 0.215742
O  -2.573635 0.277037 -0.338502
N  -1.687588 1.169123 -0.027972
C  0.053643 -0.639887 -0.0207
C  -0.272746 0.740213 0.027979
C  1.423321 -0.989791 -0.082377
C  0.716224 1.749028 0.053958
C  -0.944984 -1.796374 0.004501
C  2.406764 0.018041 -0.054245
C  2.075212 1.388057 0.022366
C  -1.793389 -1.988358 1.252628
H  1.705482 -2.043781 -0.155052
H  0.406678 2.797018 0.082266
H  2.857829 2.150908 0.03856
H  -1.289599 -2.737492 1.895598
H  -2.77811 -2.394438 0.9719
H  -1.927401 -1.065586 1.837179
