program: Gaussian 09
title: 000255580
version: EM64L-G09RevD.01
frameworkgroup: C1[X(C5H5N3O)]
method: RPBEPBE
basis: SDD
operation: Freq
keyword: #pfreq=noraman
keyword: PBEPBE/SDD
title: #p freq=noraman PBEPBE/SDD
converged: YES YES NO YES
title: Mulliken charges:
elementType: O N N N C C C C C H H H H H
charge: -0.183315 -0.340522 0.016902 -0.080440 0.063231 -0.161824 -0.254284 -0.261145 -0.047852 0.335784 0.240968 0.256221 0.252183 0.164095
chargesum: 0.00000
title: Mulliken charges with hydrogens summed into heavy atoms:
elementType: O N N N C C C C C
charge: -0.183315 -0.004739 0.016902 -0.080440 0.063231 0.079144 0.001938 -0.008962 0.116242
polarizability: 1.18266428e+02 1.36880962e+00 7.93720651e+01 -5.05338408e-04 5.00065682e-03 3.12280762e+01
1716.lowfreq: -8.2602 0.0003 0.0003 0.0006 4.0258 12.1365 50.4381 148.8041 155.5321
frequency: 50.4024 148.7999 155.5307 284.4519 338.4580 398.9701 528.3141 528.8838 618.6490 726.6672 767.9274 794.2998 816.0668 843.8633 939.6362 959.3134 963.0253 981.3608 1050.3502 1082.7475 1103.8203 1208.0254 1261.7846 1339.1883 1387.3847 1396.5315 1431.3899 1485.7879 1531.1786 1549.9122 1668.0637 2905.2377 3143.0243 3145.1228 3189.2701 3507.9470
redmass: 7.0418 3.6354 7.8994 3.0072 8.2029 4.0906 7.0867 2.6016 8.2790 1.1867 6.9717 2.1464 2.0834 6.6638 9.0694 1.3822 1.6233 1.4520 2.9978 1.6313 2.5828 2.4712 3.3259 1.8936 1.5495 1.3177 2.1819 2.8089 4.0509 4.7395 5.8424 1.0857 1.0901 1.0934 1.0993 1.0765
irintensity: 2.2254 27.6235 9.7033 6.5827 4.1726 0.0002 13.0625 4.2616 5.5759 79.4112 11.4555 1.5188 85.0218 5.0330 2.5509 0.0130 0.1352 0.6257 11.6049 0.8977 61.8406 3.0882 4.4112 4.9057 14.7545 54.7655 227.4175 553.9934 173.1701 71.5086 189.4770 139.3632 12.6210 16.4308 13.3990 36.8855
temp: 298.150 k
press: 1.00000 atm
elementType: 8 7 7 7 6 6 6 6 6 1 1 1 1 1
symmnumber: 1
zpe: 264562.4 jmol-1
zpe.correction: 0.100767 hartree
zpe.thermalcorrener: 0.108135 hartree
zpe.thermalcorrenthalpy: 0.109080 hartree
zpe.thermalcorrgfe: 0.068060 hartree
zpe.sumelectzpe: -432.354018 hartree
zpe.sumelectthermal: -432.346649 hartree
zpe.sumelectthermalent: -432.345705 hartree
zpe.sumelectthermalfe: -432.386724 hartree
dipole: 3.3789 -2.6333 -0.0004
dipole: 4.2839
quadrupole: -45.5673 -51.2362 -53.0786
quadrupole: 12.7622 0.0017 -0.0009
quadrupole: 4.3934 -1.2755 -3.1179 12.7622 0.0017 -0.0009
hfenergy: -432.4547846 hartree
pointgroup: C01 [X(C5H5N3O1)]
dipole: -1.3639857 -0.9900031 0.0001429 debye
dipolederiv: -0.726651 -0.1074501 -0.0000021 -0.6888379 -0.7254237 -0.0001295 0.0003499 0.0002365 -0.3189255 -2.113206 0.0298386 0.0001453 0.0646931 -0.343125 0.0000288 0.0000569 -0.0000497 -0.3732962 -0.6151828 0.0724981 -0.0000194 0.6045123 -0.4678972 0.0000068 -0.0000639 0.0000142 -0.1934797 -0.9974659 0.2009315 0.0000014 -0.2020261 -0.3798908 0.0000068 -0.0000708 0.0000328 -0.2322437 1.7440614 -0.3410867 0.0000037 -0.7355481 0.3847108 0.0000089 0.000053 -0.0000218 0.2259039 -0.1965442 -0.1520956 0.0000077 -0.1060968 -0.4670486 0.0000164 0.000008 0.0000224 -0.0863439 0.4795909 0.1158635 0.0000063 -0.1551208 0.4689956 -0.0000337 0.0000419 -0.0000341 -0.033674 0.5088197 -0.1081277 0.0000213 0.1114676 0.467339 -0.0000228 0.0000207 -0.0000379 -0.0359513 1.8816249 0.1899081 -0.0001843 0.856312 1.0303929 0.0001389 -0.0006079 0.0000071 0.1729034 0.1604984 -0.0269327 -0.000004 -0.0117949 0.1808894 0.0000082 -0.0000426 -0.0000062 0.3333943 -0.0636295 0.0638095 -0.0000117 0.0645326 0.0858896 0.0000076 -0.0000166 0.0000091 0.1817358 0.0798488 0.026006 -0.0000018 0.0691288 -0.0761651 0.0000142 -0.0000072 0.000009 0.1201154 -0.0396222 -0.0778565 0.0000007 -0.1091045 0.0291091 0.0000026 0.0000075 0.0000023 0.1197239 -0.1021426 0.114694 0.0000369 0.2378828 -0.187776 -0.0000532 0.0002711 -0.0001837 0.1201374 unknown
polarizability: 118.1275911|-2.6933878|79.5109021|-0.0006759|-0.0049805|31.2280762 unknown
InChI: InChI=1S/C5H5N3O/c9-4-8-5-6-2-1-3-7-5/h1-4,8H
charge 0 multiplicity 1
14 atoms
O  2.949458 0.853238 -0.00032
N  1.378592 -0.942666 0.000231
N  -0.038571 0.998102 0.000064
N  -0.913518 -1.29157 0.000187
C  0.100433 -0.358432 0.000174
C  -2.446233 0.596062 0.000013
C  -1.324925 1.456007 -0.000012
C  -2.180029 -0.793985 0.000107
C  2.659586 -0.361209 0.00027
H  1.336584 -1.967542 0.000237
H  -3.467079 0.984441 -0.000043
H  -1.437146 2.545747 -0.000086
H  -2.98735 -1.534182 0.000128
H  3.429997 -1.169911 -0.00035
