program: Gaussian 09
title: 000255562
version: EM64L-G09RevD.01
frameworkgroup: C1[X(C12H12N4)]
method: RPBEPBE
basis: SDD
operation: Freq
keyword: #pfreq=noraman
keyword: PBEPBE/SDD
title: #p freq=noraman PBEPBE/SDD
converged: NO YES NO NO
title: Mulliken charges:
elementType: N N N N C C C C C C C C C C C C H H H H H H H H H H H H
charge: -0.080392 -0.080392 -0.080391 -0.080391 0.121203 0.121202 -0.419235 -0.419235 -0.477233 -0.477234 -0.477234 -0.477234 -0.010199 -0.010200 -0.010202 -0.010201 0.223833 0.223843 0.223843 0.223833 0.254817 0.238188 0.238188 0.254816 0.238187 0.254816 0.254817 0.238187
chargesum: 0.00000
title: Mulliken charges with hydrogens summed into heavy atoms:
elementType: N N N N C C C C C C C C C C C C
charge: -0.080392 -0.080392 -0.080391 -0.080391 0.121203 0.121202 0.028440 0.028440 0.015772 0.015771 0.015769 0.015770 -0.010199 -0.010200 -0.010202 -0.010201
polarizability: 1.99127195e+02 -3.11560121e-05 1.62484892e+02 -1.97767494e-03 1.03950966e-02 8.61675127e+01
1716.lowfreq: -13.9071 0.0001 0.0001 0.0002 5.5656 6.3279 89.1327 93.6455 121.8222
frequency: 89.1116 93.6455 121.8211 157.6008 207.9219 271.2145 316.1307 338.5605 347.0702 383.5128 396.4373 427.0352 452.2403 453.5023 472.2136 524.0652 538.6136 548.1643 554.3866 662.5643 676.6021 708.7745 721.0989 820.0450 825.5791 840.3765 848.8694 853.4842 882.7348 886.3686 890.8255 977.8411 980.7952 1012.4350 1049.0559 1058.3120 1058.6892 1078.4150 1121.3143 1126.9912 1145.5605 1164.0297 1194.0801 1227.5516 1229.7532 1235.2682 1246.7346 1292.0007 1302.1778 1307.5454 1322.7659 1325.2708 1346.8981 1351.7025 1371.9201 1409.1701 1421.5102 1436.6816 1443.2861 1452.9756 1453.3470 1456.9883 1472.9101 1473.7592 1548.9952 1574.0572 2973.5805 2973.6086 2975.9694 2976.2209 2999.3031 2999.5261 3063.3489 3063.6044 3067.0737 3067.1003 3071.4107 3071.5952
redmass: 2.6945 4.0986 2.7942 7.9782 2.5221 1.9073 3.9597 2.2953 3.7245 7.9651 3.6986 7.4829 4.5090 4.0132 5.9342 2.1603 5.7953 7.5706 3.1506 5.8182 4.1235 5.9631 3.0702 6.6495 5.8540 1.5759 2.9235 1.5063 2.7593 1.9706 8.4044 2.5295 3.5719 5.8983 2.0028 2.0940 2.0218 2.7819 1.2898 2.3881 1.6516 1.4900 1.4581 4.0436 1.4587 1.2546 2.5143 1.8871 2.6329 1.5654 1.4076 1.4736 1.4959 2.5564 2.5844 7.3951 3.2729 4.5139 1.0993 1.0790 1.3515 1.2297 1.0863 1.1036 8.3347 11.2915 1.0680 1.0681 1.0673 1.0674 1.0617 1.0617 1.0974 1.0974 1.0931 1.0931 1.0981 1.0981
irintensity: 0.0000 10.3478 0.4929 10.9200 0.7193 0.8376 8.5096 0.5929 0.0000 0.6310 0.3715 0.0000 1.0606 1.3042 0.0000 2.1702 0.6898 0.0001 5.4837 0.0000 0.2073 0.0000 11.1471 6.6292 3.9303 2.6625 6.1670 0.0000 1.2236 0.5896 15.8246 8.5898 0.9672 0.5662 0.0000 1.9538 0.2939 2.6441 0.3120 0.0000 0.0000 0.8118 0.0000 0.9086 0.4240 4.0174 14.1847 0.0000 1.1243 17.7652 1.1750 0.0000 4.0839 0.2507 0.0000 124.9088 13.9884 29.9274 0.0000 15.7142 14.3175 27.2515 12.2803 25.0782 0.0000 0.0000 20.1718 7.9590 14.1590 0.0005 28.2703 44.8605 84.3124 2.6220 0.0419 19.8615 0.1046 33.9921
temp: 298.150 k
press: 1.00000 atm
elementType: 7 7 7 7 6 6 6 6 6 6 6 6 6 6 6 6 1 1 1 1 1 1 1 1 1 1 1 1
symmnumber: 1
zpe: 581885.8 jmol-1
zpe.correction: 0.221629 hartree
zpe.thermalcorrener: 0.233417 hartree
zpe.thermalcorrenthalpy: 0.234361 hartree
zpe.thermalcorrgfe: 0.184199 hartree
zpe.sumelectzpe: -682.305444 hartree
zpe.sumelectthermal: -682.293655 hartree
zpe.sumelectthermalent: -682.292711 hartree
zpe.sumelectthermalfe: -682.342873 hartree
dipole: 0.0000 0.0000 -0.1684
dipole: 0.1684
quadrupole: -70.4248 -122.7525 -90.4004
quadrupole: 0.0000 -0.0004 -0.0043
quadrupole: 24.1011 -28.2266 4.1255 0.0000 -0.0004 -0.0043
hfenergy: -682.5270724 hartree
pointgroup: C01 [X(C12H12N4)]
dipole: 0.0000033 0.0000157 0.0662583 debye
polarizability: 199.1271952|-0.0013176|162.4848918|-0.0019781|-0.010395|86.1675127 unknown
InChI: InChI=1S/C12H12N4/c1-3-7-11-8(4-1)14-16-10-6-2-5-9(12(10)11)15-13-7/h1-6H2
charge 0 multiplicity 1
28 atoms
N  0.705431 -2.443915 0.048245
N  -0.705653 -2.443862 0.048266
N  0.705611 2.443902 0.047581
N  -0.705468 2.443954 0.047608
C  0.708038 -0.000002 0.077877
C  -0.708077 0.000051 0.077903
C  3.48244 -0.000194 -0.547426
C  -3.4825 0.000067 -0.547306
C  2.897704 1.28797 0.092725
C  -2.897646 1.288183 0.092833
C  2.897607 -1.28813 0.093095
C  -2.897742 -1.287917 0.09319
C  1.382753 -1.266779 0.073944
C  -1.382886 -1.266677 0.07399
C  1.382848 1.266722 0.073595
C  -1.382792 1.266826 0.073646
H  3.26463 -0.000341 -1.632962
H  4.581732 -0.000219 -0.437997
H  -4.581788 0.000123 -0.437839
H  -3.264727 -0.000091 -1.632849
H  3.25472 2.197582 -0.420043
H  3.237508 1.364901 1.14638
H  -3.237406 1.365129 1.146501
H  -3.254615 2.197826 -0.419913
H  3.237395 -1.364773 1.146776
H  3.254565 -2.197918 -0.419402
H  -3.254782 -2.197676 -0.4193
H  -3.237502 -1.364539 1.146881
