program: Gaussian 09
title: 000255546
version: EM64L-G09RevD.01
frameworkgroup: C1[X(C9H11IN2O)]
method: RPBEPBE
basis: SDD
operation: Freq
keyword: #p
keyword: freq=noraman
keyword: PBEPBE/SDD
title: #p freq=noraman PBEPBE/SDD
converged: YES YES NO NO
title: Mulliken charges:
elementType: I O N N C C C C C C C C C H H H H H H H H H H H
charge: 0.011419 -0.297633 -0.408269 -0.487572 -0.344531 0.479536 0.296704 -0.446223 -0.343744 -0.709111 -0.197538 -0.212623 -0.259322 0.276386 0.252424 0.300521 0.291358 0.214046 0.306233 0.310543 0.289890 0.224754 0.224876 0.227876
chargesum: 0.00000
title: Mulliken charges with hydrogens summed into heavy atoms:
elementType: I O N N C C C C C C C C C
charge: 0.011419 -0.297633 -0.107748 -0.196214 0.184278 0.479536 0.296704 -0.232177 -0.037511 -0.108678 0.027216 0.012253 -0.031446
polarizability: 1.98788377e+02 -5.30489563e-02 1.36028729e+02 1.84464424e+01 -1.62732099e+01 7.66554235e+01
1716.lowfreq: -2.9358 -0.0004 -0.0003 -0.0002 3.7448 7.9229 8.7266 30.7995 53.5341
frequency: 7.7301 30.7696 53.5002 65.4229 103.2128 125.0837 194.6670 231.6909 287.2568 323.6379 358.5950 372.7767 407.7974 444.2336 493.1284 511.1806 593.3951 599.5706 614.7668 696.6827 704.2895 704.3051 765.3779 799.2504 838.8370 839.9190 913.2925 930.4488 957.0811 969.7578 983.7791 998.2924 1014.2552 1029.3099 1089.1918 1119.9839 1157.8018 1171.7486 1188.3969 1195.2958 1216.7341 1265.8317 1290.5443 1320.6376 1364.5234 1384.9374 1424.5764 1428.9144 1432.1956 1481.1182 1489.2472 1518.0791 1600.3710 1616.6636 1642.3105 2999.7351 3056.5229 3067.0169 3105.4225 3131.0180 3142.9736 3151.7289 3164.5917 3195.4770 3524.2838 3542.8892
redmass: 5.9395 5.9142 7.2538 4.1652 3.7379 5.0039 3.8537 3.1234 4.3453 3.7440 1.9680 2.3493 2.9304 2.9830 3.1514 2.6562 1.3849 3.6174 6.3030 2.0102 4.5657 7.2174 1.6874 2.3103 3.0729 1.3218 1.4272 2.1467 2.5964 1.3485 5.9451 1.3016 2.2274 2.0675 1.5648 2.8152 1.5945 1.0523 1.1125 1.2725 1.8034 2.1132 1.2185 1.4508 1.2999 5.2123 1.4752 1.2457 1.3324 1.7977 2.2464 2.3053 5.7490 5.7552 4.3274 1.0594 1.0659 1.0933 1.0886 1.0865 1.0933 1.1108 1.0998 1.0949 1.0763 1.0771
irintensity: 2.4506 1.7509 6.6959 5.0396 4.6330 2.4303 6.9338 0.5125 4.5189 3.1292 24.8823 32.2841 0.1320 21.0585 8.3932 67.7386 107.6978 27.5208 2.3736 49.8024 24.5375 3.2559 98.1209 14.1974 17.5346 1.4831 14.2809 8.8493 9.8540 0.1197 0.8041 3.1942 1.8244 9.3390 15.1477 3.7143 3.5391 0.3983 3.8416 19.4853 386.3929 22.6399 59.2092 74.1306 21.7927 56.2706 44.6292 12.5756 32.0265 358.8025 4.8322 622.1256 50.3507 60.2229 135.1257 40.2209 12.9571 11.3851 18.3672 0.4728 32.6962 7.6307 24.7551 7.9401 6.7208 28.2824
temp: 298.150 k
press: 1.00000 atm
elementType: 53 8 7 7 6 6 6 6 6 6 6 6 6 1 1 1 1 1 1 1 1 1 1 1
symmnumber: 1
zpe: 493125.0 jmol-1
zpe.correction: 0.187821 hartree
zpe.thermalcorrener: 0.200794 hartree
zpe.thermalcorrenthalpy: 0.201738 hartree
zpe.thermalcorrgfe: 0.143409 hartree
zpe.sumelectzpe: -544.855027 hartree
zpe.sumelectthermal: -544.842055 hartree
zpe.sumelectthermalent: -544.841111 hartree
zpe.sumelectthermalfe: -544.899440 hartree
dipole: 0.6453 -1.5631 1.8121
dipole: 2.4785
quadrupole: -93.1165 -88.4190 -91.9858
quadrupole: 9.8707 2.6162 -4.7168
quadrupole: -1.9427 2.7548 -0.8121 9.8707 2.6162 -4.7168
hfenergy: -545.0428487 hartree
pointgroup: C01 [X(C9H11I1N2O1)]
dipole: 0.170998 0.7757961 -0.5654962 debye
dipolederiv: -0.1979077 -0.0749445 -0.0636149 -0.174612 -0.3510621 -0.1272407 -0.0725364 -0.0329757 -0.1710373 -0.8667136 -0.047495 0.0169231 0.1438191 -0.9066031 0.0899353 0.0156156 0.1407789 -0.3842509 -1.7968662 -0.1755427 0.0143247 -0.2594201 -0.3024836 0.0378671 0.2421415 0.0199308 -0.6440768 -2.1529349 0.1516028 0.1310954 0.6445112 -0.3484574 -0.0778969 0.1168088 -0.0263159 -0.3403577 0.7154279 -0.0761499 0.0293808 -0.6803184 -0.1823104 -0.1205584 0.1109356 0.0272504 0.3052015 1.5239636 0.047021 -0.1953607 0.3111717 0.0276291 -0.010654 -0.3352859 0.0107789 0.1479575 2.8467443 0.0766071 -0.1991803 -0.4756614 1.202033 -0.1444228 -0.2241909 -0.2466655 0.354245 -0.3795431 -0.0252566 0.0157805 0.1950568 0.0242083 -0.1006115 -0.0259791 -0.0610445 -0.2001078 -0.3347855 -0.0133968 0.0146132 -0.2860825 -0.078671 0.012061 0.1067756 -0.0235534 -0.1794762 0.0707823 0.2424753 0.0696417 0.4469404 0.6697943 0.1617597 0.045745 0.1571126 0.0065269 0.1221603 0.0038075 -0.0454642 -0.0891505 0.1097519 -0.0533526 -0.0217672 -0.0685519 -0.1166517 0.1311451 -0.0133313 -0.0401733 0.0640295 0.1479697 -0.0868061 -0.065601 -0.0765563 -0.1118746 -0.0801923 0.0261831 -0.0381296 0.0343989 -0.1714242 -0.0118176 -0.0303076 -0.0112448 -0.1850742 0.1449181 -0.0910452 -0.0559977 0.0900808 0.0427176 0.0043968 -0.1326658 -0.0699072 0.0708277 -0.1126732 0.0137118 0.0849829 0.0237536 0.1269782 0.0900636 0.0807197 0.0202247 -0.052458 0.157036 0.0186011 0.0518267 0.1003586 0.0797856 0.0376054 0.0677631 0.0195193 0.3830549 0.1282836 0.0103119 0.0344761 -0.0254898 0.0893387 0.0596196 0.0377607 0.0575541 0.2857187 0.0346919 -0.1005077 0.0535231 -0.0782091 -0.0663464 0.0780415 0.0439379 0.080538 0.1375046 0.1755725 0.0614547 -0.0066121 0.0500799 0.0712636 0.0252263 -0.0125548 0.0191541 0.1748312 0.0579293 -0.0683163 0.0744645 -0.1196126 -0.0596137 0.0167425 0.0149607 -0.0292386 -0.0033627 -0.0994662 0.0082114 -0.0337867 0.0626352 -0.1005991 -0.0148869 -0.0571539 -0.0406401 0.0956448 -0.0096408 0.1025704 -0.0015693 0.123572 -0.0388814 0.034041 -0.0043723 0.0356014 0.148016 0.0518324 -0.0535181 0.0315462 -0.0799563 -0.0764877 0.0749501 0.0400773 0.0722936 0.1254962 -0.1297639 -0.0230539 0.0573099 -0.0218952 0.0914699 0.0259376 0.0591735 0.0259571 0.1537028 unknown
polarizability: 197.8330207|13.8945301|142.977626|-6.6285027|-5.4439575|70.6618827 unknown
InChI: InChI=1S/C9H11IN2O/c10-6-7-11-9(13)12-8-4-2-1-3-5-8/h1-5,11-12H,6-7H2
charge 0 multiplicity 1
24 atoms
I  5.017135 1.651387 0.871198
O  0.932031 -1.599677 -0.097016
N  2.248302 0.206424 -0.776315
N  -0.055828 0.516048 -0.488003
C  3.480915 -0.577586 -0.721168
C  -1.421839 0.263436 -0.176383
C  1.02349 -0.377009 -0.423781
C  -2.329105 1.350004 -0.314715
C  -1.903386 -1.000857 0.257917
C  4.264156 -0.428329 0.591674
C  -3.697396 1.178276 -0.024177
C  -3.276877 -1.154027 0.546461
C  -4.182748 -0.077306 0.410129
H  3.183283 -1.640751 -0.805266
H  4.123861 -0.325439 -1.583304
H  2.335467 1.215002 -0.914079
H  0.143018 1.466997 -0.806314
H  -1.962332 2.330015 -0.648913
H  -1.204643 -1.832815 0.359632
H  3.637445 -0.622221 1.474289
H  5.171206 -1.052068 0.605569
H  -4.382537 2.02595 -0.136606
H  -3.63988 -2.132477 0.881303
H  -5.245538 -0.212076 0.636972
