program: Gaussian 09
title: 000255541
version: EM64L-G09RevD.01
frameworkgroup: C1[X(C5H10BrClN2O)]
method: RPBEPBE
basis: SDD
operation: Freq
keyword: #p
keyword: freq=noraman
keyword: PBEPBE/SDD
title: #p freq=noraman PBEPBE/SDD
converged: YES YES NO NO
title: Mulliken charges:
elementType: Br Cl O N N C C C C C H H H H H H H H H H
charge: -0.022891 -0.087114 -0.316355 -0.395153 -0.395972 -0.315601 -0.331761 0.345309 -0.643726 -0.548077 0.287096 0.228021 0.241213 0.268597 0.290496 0.296735 0.266564 0.281863 0.284610 0.266145
chargesum: 0.00000
title: Mulliken charges with hydrogens summed into heavy atoms:
elementType: Br Cl O N N C C C C C
charge: -0.022891 -0.087114 -0.316355 -0.104657 -0.099237 0.199516 0.178050 0.345309 -0.095299 0.002678
polarizability: 1.05051735e+02 -9.15443779e+00 9.36059214e+01 3.60633888e+00 3.20054641e-01 8.21541725e+01
1716.lowfreq: -11.9636 -0.0010 0.0009 0.0021 4.3329 7.6893 14.8225 18.8069 58.7941
frequency: 14.2723 18.3345 58.7741 63.6853 97.8479 135.0183 184.1972 216.9930 272.8021 331.1732 351.0377 394.0745 457.7001 486.3945 539.3169 552.0834 593.9638 685.3160 708.9326 832.6498 839.2538 909.4420 962.1574 981.0565 1013.3458 1035.8505 1105.3276 1144.8575 1165.4748 1201.9682 1216.2811 1230.0471 1241.2750 1277.5980 1298.5761 1354.4400 1369.5266 1438.5072 1440.8228 1442.2085 1465.1844 1470.4750 1513.6935 1634.3347 2929.7315 2995.7682 3043.1347 3054.0885 3065.7965 3075.1435 3127.7455 3154.6812 3542.9603 3554.2061
redmass: 13.7304 5.5458 6.2260 7.1446 3.6489 3.3897 4.5192 3.8667 2.2217 1.9569 1.7895 2.7611 2.9370 2.8286 2.7925 1.4376 4.0617 4.1399 10.2645 1.7881 1.8637 2.1087 2.2153 2.4167 1.5732 1.8044 3.6788 1.4854 1.3492 1.6799 1.2232 1.6455 1.5326 1.1452 1.1777 1.3232 1.3231 1.1221 1.1228 1.1037 1.1887 1.3374 2.3736 5.1636 1.0705 1.0596 1.0592 1.0930 1.0658 1.0890 1.1090 1.1120 1.0774 1.0771
irintensity: 0.2133 0.6885 10.8460 12.8548 6.1214 1.8839 4.1050 6.9836 1.9533 24.8743 9.3911 6.9020 8.6697 9.2926 89.1216 175.2393 36.6046 10.9533 16.1477 16.0812 2.4035 8.9532 21.2619 11.9099 1.8495 1.4209 11.0092 4.8793 3.7921 7.5959 49.1644 33.8047 244.4988 43.3328 44.0658 7.9239 2.3035 19.4828 31.4506 16.3956 6.3797 45.5184 529.1144 179.2433 57.2469 47.9317 29.3222 6.4053 20.0356 2.0613 12.4366 15.0877 18.6278 14.6507
temp: 298.150 k
press: 1.00000 atm
elementType: 35 17 8 7 7 6 6 6 6 6 1 1 1 1 1 1 1 1 1 1
symmnumber: 1
zpe: 408462.1 jmol-1
zpe.correction: 0.155575 hartree
zpe.thermalcorrener: 0.167699 hartree
zpe.thermalcorrenthalpy: 0.168643 hartree
zpe.thermalcorrgfe: 0.112406 hartree
zpe.sumelectzpe: -853.995927 hartree
zpe.sumelectthermal: -853.983803 hartree
zpe.sumelectthermalent: -853.982859 hartree
zpe.sumelectthermalfe: -854.039096 hartree
dipole: -0.4258 1.4115 -2.9687
dipole: 3.3146
quadrupole: -71.7175 -84.0006 -72.9331
quadrupole: -1.8123 9.3250 -6.5544
quadrupole: 4.4996 -7.7836 3.2840 -1.8123 9.3250 -6.5544
hfenergy: -854.151502 hartree
pointgroup: C01 [X(C5H10Br1Cl1N2O1)]
dipole: 0.5364568 0.0152119 -1.1885133 debye
dipolederiv: -0.1460545 0.084325 0.1041003 -0.0216415 -0.29959 -0.1800757 -0.0007308 -0.1935581 -0.3465505 -0.2645364 0.0663114 0.0058853 0.1550032 -0.5391167 0.0763086 -0.0263246 0.1520563 -0.2580019 -0.7877872 -0.0251092 -0.0246446 -0.0120916 -0.8256981 0.28827 0.0100849 0.342395 -0.5865055 -1.4961707 -0.1957706 -0.0673518 -0.2679918 -0.4597832 -0.1409648 0.0765729 -0.0781152 -0.412866 -1.3769846 0.2598534 -0.1951636 0.374616 -0.4532149 -0.026182 -0.2599035 -0.0273707 -0.586194 0.6855965 0.0468749 0.2511681 -0.3294862 0.0540328 -0.0142243 0.2498981 0.0195438 0.1160155 0.6729806 -0.0169901 0.0293341 0.2949271 -0.0646263 0.1509498 -0.1766966 0.1833612 0.1611354 2.3246392 -0.0065252 0.1897535 -0.0587315 1.0249477 -0.4773285 0.0361983 -0.5881986 0.6601744 0.038815 -0.1237513 -0.216291 -0.0302452 0.3745917 0.3027439 -0.1077266 0.3035468 0.5333815 0.1529079 -0.0982266 0.0303555 -0.1822004 0.6728497 -0.2535923 0.0883958 -0.2284251 0.2318687 0.1476668 -0.0463108 0.0356378 0.0474412 0.0892428 0.0639018 -0.0200172 0.0529368 0.0526684 -0.1564692 0.0055232 -0.0245135 0.1077344 -0.001816 -0.1149188 0.0815037 -0.1378356 -0.0378936 -0.1227055 -0.0168426 -0.0763364 -0.0327226 0.1164083 -0.0327477 -0.0870373 -0.0877131 -0.0690974 0.1705576 0.0620008 0.0041764 -0.0596821 0.0332399 0.0434679 0.1007093 -0.0014041 0.0949476 0.1014327 -0.0008197 -0.0137958 0.0421926 0.1814328 0.1489289 -0.0040721 0.1430698 0.2370809 0.1418422 -0.0305466 -0.0121529 -0.0871301 0.1684861 0.1206792 0.0073745 0.101655 0.2954369 0.072805 0.0052868 0.0632549 -0.0402602 -0.042453 -0.0144528 0.0762881 0.0400153 -0.1281207 -0.1055469 0.061021 -0.0313018 0.0948584 0.0222475 -0.030809 -0.0220586 -0.0498956 0.0148889 0.0735879 -0.0111215 -0.0963148 0.0156329 -0.028883 0.0173008 -0.0655424 0.0060095 -0.0474046 -0.1265762 -0.0191824 0.0442001 -0.0102226 -0.0222982 0.0727451 0.043084 0.0479267 0.0750361 unknown
polarizability: 107.20641|-7.7256557|91.7448892|-0.2228037|2.2484602|81.8605298 unknown
InChI: InChI=1S/C5H10BrClN2O/c6-1-3-8-5(10)9-4-2-7/h8-9H,1-4H2
charge 0 multiplicity 1
20 atoms
Br 2.579546 1.29574 2.018214
Cl -3.471121 2.015008 -0.498196
O  -0.148781 -1.851134 0.584812
N  1.199788 -0.33549 -0.587454
N  -1.143149 -0.206982 -0.7547
C  2.441633 -0.854695 -0.022625
C  -2.503034 -0.631782 -0.426212
C  -0.038189 -0.856426 -0.198632
C  3.392152 0.228365 0.495892
C  -3.25286 0.374618 0.447167
H  2.153649 -1.553573 0.780836
H  3.010193 -1.441713 -0.779528
H  -3.081983 -0.830009 -1.34795
H  -2.407822 -1.580852 0.135426
H  1.245914 0.431663 -1.259174
H  -1.038146 0.671481 -1.265773
H  3.648918 0.981061 -0.267599
H  4.310841 -0.217736 0.907748
H  -2.696155 0.639206 1.357391
H  -4.275692 0.043551 0.680956
