program: Gaussian 09
title: 000018229
version: EM64L-G09RevD.01
frameworkgroup: C1[X(C13H18N2O)]
method: RPBEPBE
basis: SDD
operation: Freq
keyword: #p
keyword: freq=noraman
keyword: PBEPBE/SDD
title: #p freq=noraman PBEPBE/SDD
converged: YES YES NO NO
title: Mulliken charges:
elementType: O N N C C C C C C C C C C C C C H H H H H H H H H H H H H H H H H H
charge: -0.253782 -0.229236 -0.077885 0.265315 -0.551286 -0.421266 0.377718 -0.499753 0.140628 -0.365842 -0.356504 -0.424397 -0.253875 -0.251699 -0.616641 -0.618621 0.227039 0.273184 0.233980 0.230265 0.249148 0.240268 0.206142 0.237887 0.256924 0.234448 0.228896 0.230010 0.226260 0.190514 0.222755 0.219535 0.193062 0.236805
chargesum: 0.00000
title: Mulliken charges with hydrogens summed into heavy atoms:
elementType: O N N C C C C C C C C C C C C C
charge: -0.253782 -0.229236 -0.077885 0.265315 -0.087041 0.078957 0.377718 -0.010336 0.140628 0.078188 -0.099581 -0.189949 -0.024979 -0.021689 0.022890 0.030781
polarizability: 1.79499076e+02 1.46323414e+01 1.82758034e+02 -1.46316880e+01 7.99933629e+00 1.02752926e+02
1716.lowfreq: -12.9486 -7.3818 -5.1526 0.0000 0.0004 0.0006 17.3453 40.2213 52.7125
frequency: 17.2657 40.1300 52.6833 85.4684 111.0911 137.1146 183.3436 200.2093 224.9543 239.5643 250.9423 318.4938 326.8532 348.0234 383.5137 401.7375 426.4320 438.3118 446.8331 471.7971 524.7541 540.1740 573.9716 610.1492 673.7086 690.7158 733.2324 761.8029 780.4306 795.4992 825.6148 866.0734 877.3758 915.6192 941.6031 980.8631 998.9459 1018.7192 1029.1703 1032.9632 1044.3282 1055.4612 1075.5398 1085.6242 1093.4738 1132.6896 1140.1509 1158.1976 1171.4493 1179.2300 1202.7163 1214.1607 1238.7304 1265.6997 1273.9802 1283.7554 1298.1054 1312.4430 1322.0459 1350.3057 1360.2028 1385.5574 1390.8692 1420.2520 1443.1030 1448.4363 1453.1844 1461.4262 1462.6504 1465.0439 1477.0302 1479.4753 1483.8124 1488.8310 1495.7943 1589.4667 1598.7608 1618.8350 2853.2059 2858.8903 2873.4039 2966.5320 2991.3293 3019.4150 3022.4723 3028.0808 3032.4395 3052.1713 3077.6264 3086.7348 3091.8265 3096.5024 3121.7743 3136.0259 3157.7434 3171.5240
redmass: 3.1597 3.3818 3.7789 6.0174 2.4242 2.9397 2.6671 2.7875 1.1629 1.6828 1.8543 3.1340 2.9422 2.2015 3.3352 4.0863 4.0387 2.5272 3.1701 3.5218 3.9210 4.0454 3.5136 4.5576 3.8111 4.6801 3.2447 1.4149 2.4803 1.4972 3.1591 1.3843 2.3401 3.0445 1.3791 1.3131 2.2231 2.9004 2.3358 1.5588 2.3128 2.5317 2.6086 1.5224 1.5606 1.7805 1.5489 1.2167 1.7456 1.1217 1.6806 2.0951 1.6045 2.5328 1.9238 1.9977 1.2969 1.5449 1.7132 1.6407 1.7462 1.8342 2.7043 1.1469 1.1865 2.0336 1.1506 1.1508 1.0649 1.0615 1.0506 1.0872 1.1354 1.3125 1.6288 7.0628 7.7591 7.0647 1.0609 1.0627 1.0596 1.0675 1.0656 1.0729 1.0626 1.0844 1.0761 1.0950 1.1012 1.1009 1.0953 1.1001 1.0876 1.0887 1.0942 1.0983
irintensity: 0.6354 1.0688 0.8650 2.0691 0.1784 2.8714 1.3259 1.1761 0.1968 1.3734 4.1982 4.4975 2.2457 7.3043 6.5308 1.0409 2.9656 3.6715 8.3731 7.1004 11.0110 1.2625 1.7506 3.1863 14.4552 1.0667 8.9205 85.8123 4.1850 10.0273 17.0232 0.9269 8.3377 0.8416 3.1565 0.0752 11.3342 10.9435 11.2202 18.3213 13.4832 30.8943 3.3264 7.6638 6.0919 11.7930 25.4280 2.9566 98.4423 5.9882 23.8945 1.4381 4.2278 6.0889 38.9486 29.1735 4.9086 12.8371 55.4552 10.4164 73.0371 4.5229 20.2905 2.9793 3.7753 57.8293 20.9423 6.7741 12.5264 22.6372 16.4619 20.6865 16.0992 70.3852 16.7617 90.4069 241.1540 15.2094 63.1222 55.0141 199.4616 25.0474 18.0873 38.7147 16.8049 38.4572 37.2840 26.7592 29.4815 54.5533 14.2589 5.5479 8.2990 10.4676 28.5307 13.0968
temp: 298.150 k
press: 1.00000 atm
elementType: 8 7 7 6 6 6 6 6 6 6 6 6 6 6 6 6 1 1 1 1 1 1 1 1 1 1 1 1 1 1 1 1 1 1
symmnumber: 1
zpe: 755649.1 jmol-1
zpe.correction: 0.287812 hartree
zpe.thermalcorrener: 0.303145 hartree
zpe.thermalcorrenthalpy: 0.304089 hartree
zpe.thermalcorrgfe: 0.243983 hartree
zpe.sumelectzpe: -689.706164 hartree
zpe.sumelectthermal: -689.690831 hartree
zpe.sumelectthermalent: -689.689886 hartree
zpe.sumelectthermalfe: -689.749993 hartree
dipole: -1.0752 -2.3488 1.0655
dipole: 2.7943
quadrupole: -83.3111 -103.5557 -96.8091
quadrupole: -4.4187 -1.2189 1.8743
quadrupole: 11.2475 -8.9970 -2.2505 -4.4187 -1.2189 1.8743
hfenergy: -689.9939759 hartree
pointgroup: C01 [X(C13H18N2O1)]
dipole: 0.4880952 0.8425585 0.5103457 debye
polarizability: 181.2768473|13.3758642|181.3283171|16.9150223|-1.5601553|102.4048721 unknown
InChI: InChI=1S/C13H18N2O/c1-14(2)9-10-15-12-6-4-3-5-11(12)7-8-13(15)16/h3-6H,7-10H2,1-2H3
charge 0 multiplicity 1
34 atoms
O  -0.699353 -3.016383 -0.588005
N  -0.045448 -0.775389 -0.435822
N  -3.422516 0.920247 0.039389
C  0.98153 0.206832 -0.226015
C  2.35777 -1.617552 0.858976
C  -1.42633 -0.350442 -0.772224
C  2.202971 -0.17785 0.405044
C  1.667345 -2.560506 -0.146071
C  0.215515 -2.161023 -0.394247
C  -2.153439 0.273224 0.442217
C  0.792564 1.559805 -0.612523
C  3.210893 0.787756 0.604413
C  1.811325 2.512387 -0.394938
C  3.029142 2.133353 0.210498
C  -3.936058 1.833575 1.081391
C  -4.455288 -0.0454 -0.395895
H  -1.416167 0.376412 -1.603714
H  -1.945024 -1.259847 -1.113877
H  3.424886 -1.88027 0.96745
H  1.891548 -1.748872 1.857852
H  1.662012 -3.607054 0.19865
H  2.199985 -2.53135 -1.118058
H  -2.304096 -0.520303 1.218111
H  -1.506957 1.05069 0.889682
H  -0.139801 1.88057 -1.085159
H  4.148565 0.479121 1.08264
H  1.648533 3.550535 -0.704601
H  3.821652 2.870644 0.375317
H  -3.169078 2.590204 1.325285
H  -4.222704 1.312024 2.029841
H  -4.829265 2.36204 0.702344
H  -5.357379 0.503988 -0.719056
H  -4.752378 -0.760132 0.412875
H  -4.096956 -0.634734 -1.256469
