program: Gaussian 09
title: 000255518
version: EM64L-G09RevD.01
frameworkgroup: C1[X(C26H17NO2S2)]
method: RPBEPBE
basis: SDD
operation: Freq
keyword: #p
keyword: freq=noraman
keyword: PBEPBE/SDD
title: #p freq=noraman PBEPBE/SDD
converged: YES YES NO NO
title: Mulliken charges:
elementType: S S O O N C C C C C C C C C C C C C C C C C C C C C C C C C C H H H H H H H H H H H H H H H H H
charge: 0.840688 0.247330 -0.561777 -0.560905 -0.061979 0.282678 0.282504 -0.497610 -0.497378 0.382854 0.383094 -0.349208 -0.345777 0.421819 0.421611 -0.137123 -0.467336 -0.468468 -0.367865 -0.368088 -0.421614 -0.421550 -0.231686 -0.232054 -0.242739 -0.242855 -0.238287 -0.238220 -0.208791 -0.208691 -0.223384 0.320660 0.319749 0.250812 0.250986 0.241773 0.241683 0.249986 0.250040 0.281464 0.282112 0.234985 0.234948 0.236333 0.236302 0.233968 0.233966 0.231039
chargesum: 0.00000
title: Mulliken charges with hydrogens summed into heavy atoms:
elementType: S S O O N C C C C C C C C C C C C C C C C C C C C C C C C C C
charge: 0.840688 0.247330 -0.561777 -0.560905 -0.061979 0.282678 0.282504 -0.497610 -0.497378 0.382854 0.383094 -0.028548 -0.026028 0.421819 0.421611 -0.137123 -0.216524 -0.217481 -0.126092 -0.126405 -0.171628 -0.171509 0.049778 0.050058 -0.007754 -0.007907 -0.001954 -0.001918 0.025177 0.025275 0.007655
polarizability: 5.86960136e+02 9.84553024e-01 5.36442173e+02 2.97855649e+00 -5.88111857e+01 2.59577932e+02
1716.lowfreq: -6.6993 -4.6137 -3.5793 0.0017 0.0020 0.0026 4.6463 13.5031 24.5398
frequency: -2.4108 13.3960 24.4519 37.7032 42.3261 45.5742 74.8058 87.0545 104.0142 108.0312 117.2689 118.0976 148.5042 171.0229 182.3675 210.9890 228.4265 229.4259 237.4862 262.5764 304.6651 322.1481 343.7829 368.0535 372.2016 398.5894 402.5761 406.9133 410.7301 425.2136 432.3800 461.6787 488.9544 522.2182 524.7688 528.0205 528.0802 528.7066 541.1365 553.3519 569.6531 602.6155 643.7394 648.1791 651.8404 665.1753 690.0589 692.4031 712.7297 733.2234 752.7677 759.4260 761.6185 768.9408 787.8641 792.5542 810.8635 813.4682 819.9616 835.3221 837.5231 846.5635 881.5277 883.2375 925.7030 930.3097 933.9328 957.7998 958.6255 975.1005 977.6199 978.7742 981.0630 994.0259 994.2819 997.9629 1000.1815 1001.7834 1005.4605 1035.6901 1037.8116 1041.4742 1070.3627 1130.8733 1141.1690 1157.9909 1168.9932 1169.8393 1173.3332 1179.2622 1180.5907 1224.5617 1235.9324 1237.5457 1267.2824 1274.4349 1296.7631 1309.9165 1331.1639 1337.1062 1377.2691 1381.5566 1393.3608 1400.2733 1402.8170 1417.4435 1429.0908 1430.4081 1441.9486 1447.2936 1448.1436 1492.1299 1500.5735 1535.9663 1547.9834 1574.5471 1596.0548 1597.0131 1603.9293 1619.0941 1622.7026 3129.1013 3129.4731 3129.5758 3134.4681 3134.9851 3140.2393 3141.6198 3142.6629 3150.1766 3150.6079 3151.7390 3159.9337 3168.4038 3168.7062 3168.9876 3171.2234 3174.4248
redmass: 6.4955 5.8750 4.2203 7.4185 5.5019 7.6594 6.1430 7.1441 9.2875 5.7120 6.1005 4.9991 6.4072 9.2062 5.9875 4.3000 4.4074 5.9926 8.3013 7.8019 5.0490 7.4262 11.5715 6.6414 6.7591 7.1796 2.8266 3.1666 9.5800 3.3874 6.1564 8.4371 4.0449 3.3999 6.3563 7.7603 4.7585 4.9822 3.6289 3.4962 6.2541 6.4728 6.9112 6.7815 6.7266 3.1665 3.1207 2.3457 7.9688 12.9555 1.4453 1.3392 1.3611 6.4027 3.1576 2.9615 5.4688 5.7975 8.6659 1.6016 1.5601 1.2679 1.6667 1.6798 1.3600 7.5999 7.4554 1.3617 1.3657 6.0587 1.3876 1.4005 1.3981 1.3943 1.3908 1.3446 4.4310 4.4723 4.7227 2.2687 2.2232 1.9863 1.5328 1.8946 1.7453 1.3175 1.0558 1.2961 1.1278 1.0903 1.1169 2.7808 1.9350 2.1821 1.6447 1.7057 1.3084 2.7958 4.6341 2.6306 6.9403 8.9521 5.8824 2.5010 3.2125 3.7728 3.8321 2.2089 2.3310 2.1350 2.0573 3.1331 3.3817 6.2268 7.1081 5.8773 6.0901 6.8640 5.9213 6.3098 6.6494 1.0858 1.0851 1.0857 1.0890 1.0890 1.0883 1.0896 1.0898 1.0948 1.0948 1.0924 1.0961 1.1005 1.1006 1.1013 1.0977 1.0974
irintensity: 0.1835 0.6914 0.0597 0.9619 0.4047 1.0717 2.4619 5.9458 0.0784 0.7870 1.3265 0.8520 4.5898 0.3063 9.0946 1.1001 2.5692 0.0224 12.5403 1.0739 0.2439 0.8705 55.0183 8.8828 38.9046 21.2546 0.0148 0.5372 3.2461 12.4042 7.0953 27.2028 102.7859 0.0568 0.6204 0.2648 12.7298 11.0664 0.4442 2.2478 0.7610 0.0362 1.6232 19.2742 0.2935 0.5010 5.8144 20.9995 36.6784 89.7732 52.3547 0.6756 105.3898 0.0682 0.0053 2.3938 1.2670 3.8789 43.4564 73.6538 33.6709 0.5339 1.7656 17.3878 3.2800 2.6349 11.1352 1.4954 4.2892 26.2058 0.1451 5.0778 6.7818 3.1707 1.6073 3.8497 12.1287 0.1146 8.6017 8.4930 3.7364 15.1274 8.8854 3.8795 2.6212 9.6780 0.0081 13.0424 29.5409 6.2601 0.5043 33.8534 4.0965 3.4770 8.3234 8.9091 2.6712 20.1503 0.7803 39.1966 90.0313 1.6173 23.5842 9.8108 0.9843 5.2554 0.1184 11.3672 0.2432 58.5286 12.6812 18.5435 38.0388 1.3967 19.4043 35.6448 0.3696 1.0083 17.9845 29.1602 10.5545 3.6054 0.4329 2.1088 0.7777 1.9107 11.2062 6.3586 6.1952 23.3132 17.2805 1.6344 6.1418 44.1372 52.7736 48.5011 10.3730 8.2236
temp: 298.150 k
press: 1.00000 atm
elementType: 16 16 8 8 7 6 6 6 6 6 6 6 6 6 6 6 6 6 6 6 6 6 6 6 6 6 6 6 6 6 6 1 1 1 1 1 1 1 1 1 1 1 1 1 1 1 1 1
symmnumber: 1
zpe: 919267.9 jmol-1
zpe.correction: 0.350131 hartree
zpe.thermalcorrener: 0.375138 hartree
zpe.thermalcorrenthalpy: 0.376082 hartree
zpe.thermalcorrgfe: 0.293423 hartree
zpe.sumelectzpe: -2000.064282 hartree
zpe.sumelectthermal: -2000.039275 hartree
zpe.sumelectthermalent: -2000.038331 hartree
zpe.sumelectthermalfe: -2000.120990 hartree
dipole: 0.1501 -5.7856 6.1118
dipole: 8.4173
quadrupole: -149.9687 -189.6783 -196.5657
quadrupole: 1.1491 -0.2630 10.9181
quadrupole: 28.7689 -10.9408 -17.8282 1.1491 -0.2630 10.9181
hfenergy: -2000.4144126 hartree
pointgroup: C01 [X(C26H17N1O2S2)]
dipole: 0.6902438 -2.5700085 1.9711372 debye
polarizability: 540.7452854|3.4832166|553.0127014|104.6430547|37.4678188|289.2222539 unknown
InChI: InChI=1S/C20H12NS.C6H5O2S/c1-3-7-15-13(5-1)9-11-17-19(15)22-20-16-8-4-2-6-14(16)10-12-18(20)21-17;7-9(8)6-4-2-1-3-5-6/h1-12H;1-5H
charge 0 multiplicity 1
48 atoms
S  -1.197945 2.549554 -1.126112
S  1.109515 -2.042868 0.023396
O  -2.395728 2.414619 -2.276505
O  -0.093734 3.792661 -1.249371
N  0.360642 0.476181 -1.828374
C  -0.446221 -0.650678 -1.88218
C  1.506919 0.541069 -1.050732
C  -0.260247 -1.865862 -1.154524
C  2.008189 -0.47981 -0.185852
C  -1.141017 -2.990248 -1.322182
C  3.233599 -0.314652 0.548124
C  -1.571053 -0.557662 -2.791059
C  2.255527 1.776708 -1.163136
C  -2.253695 -2.855776 -2.243058
C  3.951484 0.938067 0.407322
C  -2.168537 2.98559 0.465491
C  -2.440258 -1.61983 -2.957271
C  3.428424 1.964352 -0.455666
C  -0.976214 -4.232654 -0.621824
C  3.776332 -1.323048 1.414183
C  -3.144524 -3.958263 -2.423684
C  5.169451 1.126964 1.130408
C  -1.508402 3.714927 1.469508
C  -3.501353 2.552629 0.5731
C  -1.867169 -5.291104 -0.816831
C  4.967444 -1.10625 2.111434
C  -2.96152 -5.156157 -1.7251
C  5.672562 0.128289 1.970427
C  -2.229285 4.022973 2.647478
C  -4.207181 2.869635 1.757812
C  -3.571007 3.596418 2.792284
H  -1.704478 0.397936 -3.305938
H  1.827152 2.54987 -1.80662
H  -3.289647 -1.531093 -3.643228
H  3.978301 2.907296 -0.546618
H  -0.139326 -4.359101 0.073949
H  3.254223 -2.279212 1.531064
H  -3.981141 -3.847272 -3.122995
H  5.705478 2.076045 1.015543
H  -0.479764 4.056396 1.313561
H  -3.973865 2.019259 -0.258335
H  -1.725498 -6.231229 -0.273564
H  5.365907 -1.886898 2.767823
H  -3.653135 -5.992455 -1.871486
H  6.605882 0.287393 2.520663
H  -1.745469 4.598911 3.443948
H  -5.250885 2.555232 1.867322
H  -4.123737 3.838848 3.706806
