program: Gaussian 09
title: 000255515
version: EM64L-G09RevD.01
frameworkgroup: C1[X(C18H14ClNS)]
method: RPBEPBE
basis: SDD
operation: Freq
keyword: #p
keyword: freq=noraman
keyword: PBEPBE/SDD
title: #p freq=noraman PBEPBE/SDD
converged: YES YES NO NO
title: Mulliken charges:
elementType: Cl S N C C C C C C C C C C C C C C C C C C H H H H H H H H H H H H H H
charge: -0.051267 0.225872 -0.253685 0.593363 0.506732 -0.412736 -0.438255 -0.575656 -0.328535 0.408628 0.404031 -0.520520 -0.330798 -0.611753 -0.274096 -0.433826 -0.423661 -0.263261 -0.248905 -0.244467 -0.243811 0.270392 0.270611 0.246121 0.251337 0.241045 0.289427 0.294430 0.245383 0.240293 0.243074 0.231085 0.235426 0.228569 0.229414
chargesum: 0.00000
title: Mulliken charges with hydrogens summed into heavy atoms:
elementType: Cl S N C C C C C C C C C C C C C C C C C C
charge: -0.051267 0.225872 -0.253685 0.593363 0.506732 -0.412736 0.102748 -0.329536 -0.328535 0.408628 0.404031 -0.269183 -0.089753 -0.027897 -0.028714 -0.193533 -0.180587 -0.032177 -0.013479 -0.015898 -0.014397
polarizability: 4.09160872e+02 -2.40073079e+01 2.52420347e+02 -1.16654515e+00 4.76633240e+00 9.99426622e+01
1716.lowfreq: -6.3817 -1.7619 0.0016 0.0018 0.0020 5.6498 27.2574 34.5632 47.3850
frequency: 27.2261 34.5595 47.3424 73.4771 109.1658 138.2407 172.1852 188.5237 204.5231 227.0691 257.8485 270.4691 295.4090 305.7779 364.3607 370.4318 410.0496 431.8461 440.0430 462.0769 475.6328 480.9225 535.9117 551.0869 556.3086 582.8314 617.3890 627.7548 657.1343 689.7270 695.6494 717.3490 727.0701 749.6617 754.6339 774.4824 781.6990 790.2603 831.8619 840.8811 843.8635 877.3492 906.1727 915.0540 927.2383 959.4154 970.4228 979.5848 986.6735 1015.2116 1022.1995 1026.0215 1035.8555 1055.9766 1094.1765 1132.9138 1139.1880 1165.5251 1172.8817 1181.1603 1216.8824 1231.6235 1254.9872 1256.7406 1269.2589 1286.5728 1288.6086 1311.7408 1357.5210 1363.4424 1378.1722 1402.2934 1426.6299 1429.9843 1438.5262 1459.7604 1471.0303 1479.2628 1502.1905 1508.0392 1571.5245 1580.9722 1587.4994 1605.1832 1631.5387 3030.4260 3077.0689 3085.7280 3119.6888 3125.7825 3132.2468 3135.9014 3143.2876 3143.9381 3154.6974 3161.0289 3163.3852 3166.3337 3178.7423
redmass: 11.5591 7.5559 5.2616 4.2790 4.9159 5.2386 5.8136 3.3092 6.2893 5.5099 4.3744 5.8233 5.7285 5.6883 4.6891 4.0201 5.3576 5.4635 3.7257 4.5336 2.9252 4.3287 4.1067 3.9537 5.1362 7.0166 6.6254 6.7365 6.4856 6.0643 5.0069 4.0424 3.5953 1.3934 1.2612 2.2930 4.3641 1.3531 3.1432 1.3965 1.3859 1.4574 1.9006 4.2143 1.3717 1.4037 1.3180 3.6285 1.3377 4.1175 2.1562 2.2490 4.9584 1.9385 3.4180 1.6154 1.5705 1.3746 1.0926 1.0913 1.6477 1.5990 1.7507 1.4698 1.8935 1.4841 1.7189 1.7357 2.2109 1.2954 5.3277 5.3281 3.0015 2.5419 3.7077 3.2182 1.4323 1.6604 1.1691 3.0557 6.0898 6.8256 6.4692 6.6500 6.7561 1.0609 1.0569 1.1037 1.0863 1.0889 1.0915 1.0858 1.0945 1.0907 1.1103 1.0909 1.0995 1.0946 1.0978
irintensity: 1.2181 0.6296 0.0943 0.0852 0.2669 0.3868 1.6934 1.0266 0.2718 7.4580 1.0674 1.6989 0.9084 1.1309 4.7719 0.5952 1.3245 0.4330 2.8977 2.6254 9.6615 16.7253 0.7159 0.4344 1.6891 10.6271 21.6011 11.4177 5.1056 15.5689 5.6557 9.6180 19.4598 82.8815 64.2204 2.9155 1.6370 20.6703 10.0797 5.2038 3.4238 61.0058 1.0661 4.3801 1.6496 8.3581 0.0013 1.0512 0.0034 1.8925 0.5268 6.6493 18.1790 7.3663 27.8379 16.0007 8.8899 68.7710 0.6561 1.7345 38.6597 4.0255 47.0099 49.5876 7.8006 28.8718 10.2141 11.9372 152.1212 0.0114 2.1211 2.2222 9.6038 15.6664 1.3670 326.6764 58.8169 61.3808 43.8373 25.1901 17.8886 0.3965 34.8517 36.2981 17.3037 14.3344 13.5067 6.3671 5.0742 0.1259 4.1765 0.7489 28.4012 9.3083 11.9070 19.0731 36.3050 27.3728 18.1559
temp: 298.150 k
press: 1.00000 atm
elementType: 17 16 7 6 6 6 6 6 6 6 6 6 6 6 6 6 6 6 6 6 6 1 1 1 1 1 1 1 1 1 1 1 1 1 1
symmnumber: 1
zpe: 704624.4 jmol-1
zpe.correction: 0.268377 hartree
zpe.thermalcorrener: 0.285385 hartree
zpe.thermalcorrenthalpy: 0.286329 hartree
zpe.thermalcorrgfe: 0.222272 hartree
zpe.sumelectzpe: -1605.752395 hartree
zpe.sumelectthermal: -1605.735387 hartree
zpe.sumelectthermalent: -1605.734442 hartree
zpe.sumelectthermalfe: -1605.798500 hartree
dipole: 0.2583 -0.3591 -0.6778
dipole: 0.8094
quadrupole: -119.3553 -137.9399 -143.4259
quadrupole: -2.8042 -1.2733 1.4001
quadrupole: 14.2184 -4.3662 -9.8522 -2.8042 -1.2733 1.4001
hfenergy: -1606.0207718 hartree
pointgroup: C01 [X(C18H14Cl1N1S1)]
dipole: -0.1131933 -0.1404242 0.2624421 debye
polarizability: 411.8946399|11.918898|249.8341112|0.1696846|-0.5109689|99.7951299 unknown
InChI: InChI=1S/C18H14ClNS/c19-9-10-20-15-7-3-4-8-17(15)21-18-12-14-6-2-1-5-13(14)11-16(18)20/h1-8,11-12H,9-10H2
charge 0 multiplicity 1
35 atoms
Cl -1.365203 4.766643 0.002185
S  -0.954284 -2.500277 -0.696798
N  -1.136541 0.633072 -0.455708
C  0.176627 0.087193 -0.299512
C  -2.334927 -0.083443 -0.139757
C  0.397569 -1.339826 -0.288274
C  -1.251314 2.076993 -0.748747
C  1.307304 0.914415 -0.169447
C  -2.380453 -1.50686 -0.130928
C  2.630348 0.388915 -0.019284
C  2.82135 -1.041774 0.038207
C  1.667413 -1.877689 -0.098524
C  -3.546102 0.604478 0.160932
C  -1.218434 2.956398 0.520686
C  -3.559513 -2.202706 0.203343
C  3.775308 1.243475 0.10008
C  4.139574 -1.570748 0.215378
C  -4.735954 -0.092967 0.45818
C  -4.750691 -1.502554 0.494386
C  5.053408 0.703328 0.273105
C  5.238739 -0.714111 0.332637
H  -0.428931 2.371182 -1.422576
H  -2.189649 2.259259 -1.299218
H  1.208793 2.003053 -0.178005
H  1.791479 -2.96664 -0.079417
H  -3.580074 1.696201 0.162379
H  -2.063659 2.767755 1.196105
H  -0.27359 2.877945 1.074802
H  -3.544612 -3.297954 0.21584
H  3.637506 2.330697 0.055347
H  4.276499 -2.657783 0.257255
H  -5.646916 0.475892 0.672291
H  -5.66585 -2.050092 0.739268
H  5.920967 1.36595 0.364275
H  6.24521 -1.12392 0.469414
