program: Gaussian 09
title: 000255513
version: EM64L-G09RevD.01
frameworkgroup: C1[X(C17H12Cl2O3)]
method: RPBEPBE
basis: SDD
operation: Freq
keyword: #p
keyword: freq=noraman
keyword: PBEPBE/SDD
title: #p freq=noraman PBEPBE/SDD
converged: YES YES NO NO
title: Mulliken charges:
elementType: Cl Cl O O O C C C C C C C C C C C C C C C C C H H H H H H H H H H H H
charge: -0.035453 -0.035583 -0.197103 -0.201675 -0.198712 -0.658518 -0.651779 0.247656 0.138573 0.145649 0.329710 0.302753 -0.332878 -0.338750 -0.342510 -0.316537 -0.215865 -0.216484 -0.224067 -0.229448 -0.103617 -0.101461 0.274560 0.261122 0.280072 0.260290 0.283202 0.282981 0.270949 0.273197 0.262701 0.262970 0.262487 0.261567
chargesum: 0.00000
title: Mulliken charges with hydrogens summed into heavy atoms:
elementType: Cl Cl O O O C C C C C C C C C C C C C C C C C
charge: -0.035453 -0.035583 -0.197103 -0.201675 -0.198712 -0.122837 -0.111416 0.247656 0.138573 0.145649 0.329710 0.302753 -0.049676 -0.055769 -0.071561 -0.043340 0.046836 0.046487 0.038419 0.032119 -0.103617 -0.101461
polarizability: 2.26712047e+02 2.31800494e+01 2.45231072e+02 -3.84978001e+01 3.39693359e+00 1.71424170e+02
1716.lowfreq: -4.6542 -0.0015 -0.0011 0.0011 3.0201 4.7463 7.5643 17.9522 29.0485
frequency: 4.5316 17.8196 29.0474 40.3303 49.1102 64.5189 83.1268 86.4256 96.9311 145.1652 166.1721 172.3891 240.5704 259.2382 272.4261 290.6080 298.6853 299.9010 365.5454 407.2742 407.8001 421.2025 430.1556 457.2479 468.8200 476.7676 501.5898 519.3874 543.0489 595.1405 603.0595 621.2709 622.4573 677.2232 691.3600 719.0491 734.7072 748.3766 766.5141 822.3833 831.4740 838.2742 851.5555 876.7366 922.9268 943.2776 959.6017 966.6014 986.3489 991.5718 993.8773 997.5633 1004.4392 1027.5928 1071.8788 1073.4176 1084.8640 1114.8900 1116.0556 1140.4856 1183.2755 1191.6621 1204.1889 1230.9684 1258.1508 1280.8418 1296.9391 1300.1843 1303.8250 1372.5348 1372.6577 1401.1290 1401.5493 1444.9064 1455.7281 1476.9018 1477.5483 1558.9429 1560.6732 1587.1406 1587.9914 1594.7773 1599.7295 1622.1327 3018.5930 3030.4458 3093.4306 3110.9832 3152.1061 3156.1776 3159.5027 3161.3555 3175.4559 3176.4462 3179.6988 3180.3771
redmass: 13.5766 8.4048 5.2669 7.1886 5.3661 6.0278 11.0159 11.6151 10.7899 7.1813 7.3204 6.8885 7.7142 7.0562 6.6571 6.5582 7.9994 7.7240 3.6952 2.9013 2.8803 5.9006 3.5257 3.3336 3.8334 4.7305 3.3091 6.5144 5.2953 3.5905 4.6926 7.1139 7.0895 4.4483 5.3249 3.9791 4.5139 4.0855 4.1587 1.5147 1.3254 1.4143 1.5319 2.9052 2.7404 2.6108 1.4236 1.3933 3.0044 1.3694 1.5259 4.2173 3.1893 3.1229 2.9847 2.7081 2.1154 1.3636 1.3601 1.2662 1.3580 1.1447 1.7883 1.6679 1.6536 2.3382 1.5673 1.2753 1.4143 5.2429 5.2039 4.0372 4.0383 1.1070 1.1621 2.2650 2.0826 8.7241 8.6898 7.1499 7.5607 6.5097 6.9991 8.3375 1.0580 1.0589 1.1035 1.1038 1.0894 1.0889 1.0888 1.0888 1.0962 1.0965 1.0976 1.0976
irintensity: 0.1453 0.5348 0.2994 0.2797 0.8513 1.1561 2.5392 6.0537 0.8779 5.5814 8.1965 4.6656 0.6379 0.1016 2.1589 4.2396 0.2830 0.1283 9.8465 0.2868 0.5878 3.2175 5.7388 8.1579 1.3959 32.3992 31.2796 38.0618 17.5244 7.0415 6.9050 1.5500 0.8114 1.1801 3.5049 2.9074 2.2136 28.2922 25.7495 14.5368 19.7160 8.8567 89.7977 25.6165 77.7917 27.6183 1.2870 1.0099 44.1180 3.7250 16.0521 54.4764 5.8858 25.2575 38.5079 74.9572 175.8639 20.4536 20.9232 10.5960 183.2102 14.5900 165.1002 145.8242 87.7445 125.0330 16.1692 1.7055 14.9410 9.4089 7.8931 15.4815 28.3049 21.1931 58.1523 17.6050 22.9267 162.6718 152.0300 105.9790 197.5853 109.1174 43.2782 2.6548 1.4919 2.9527 6.3036 2.0584 0.7028 0.3454 0.3137 0.3631 1.7586 2.2889 2.7852 3.2612
temp: 298.150 k
press: 1.00000 atm
elementType: 17 17 8 8 8 6 6 6 6 6 6 6 6 6 6 6 6 6 6 6 6 6 1 1 1 1 1 1 1 1 1 1 1 1
symmnumber: 1
zpe: 636232.5 jmol-1
zpe.correction: 0.242328 hartree
zpe.thermalcorrener: 0.262447 hartree
zpe.thermalcorrenthalpy: 0.263391 hartree
zpe.thermalcorrgfe: 0.187962 hartree
zpe.sumelectzpe: -1799.252144 hartree
zpe.sumelectthermal: -1799.232025 hartree
zpe.sumelectthermalent: -1799.231081 hartree
zpe.sumelectthermalfe: -1799.306510 hartree
dipole: 0.7941 -1.0821 -1.4450
dipole: 1.9722
quadrupole: -145.4788 -139.0958 -142.2090
quadrupole: -6.0830 4.1051 9.0422
quadrupole: -3.2176 3.1654 0.0522 -6.0830 4.1051 9.0422
hfenergy: -1799.4944719 hartree
pointgroup: C01 [X(C17H12Cl2O3)]
dipole: -0.2760122 0.6748384 0.265439 debye
polarizability: 212.0516308|-38.7840551|183.5059492|29.1891916|10.5437868|247.8097087 unknown
InChI: InChI=1S/C17H12Cl2O3/c18-13-5-1-11(2-6-13)16(21)9-15(20)10-17(22)12-3-7-14(19)8-4-12/h1-8H,9-10H2
charge 0 multiplicity 1
34 atoms
Cl 3.941391 -0.902431 -3.763353
Cl -5.561487 0.573455 -3.007448
O  -0.332364 2.491614 1.127794
O  2.42813 -0.711194 2.906225
O  -0.604529 -1.665863 1.124752
C  1.487716 1.469307 2.38914
C  -0.911467 0.428667 2.314576
C  0.045116 1.548398 1.872676
C  2.208821 0.154336 2.012101
C  -1.233742 -0.570881 1.171726
C  2.619538 -0.058308 0.591059
C  -2.290645 -0.235606 0.16779
C  3.226287 -1.298657 0.249109
C  -2.648845 -1.242016 -0.774026
C  2.4180 0.918855 -0.422277
C  -2.94182 1.026689 0.113785
C  3.631222 -1.563445 -1.070955
C  -3.641415 -1.005882 -1.741354
C  2.81828 0.665975 -1.750872
C  -3.935527 1.278535 -0.8552
C  3.421038 -0.571329 -2.053102
C  -4.273438 0.256497 -1.763938
H  1.467625 1.498561 3.493443
H  2.03374 2.350793 2.012993
H  -0.455531 -0.157891 3.127322
H  -1.843724 0.898752 2.673558
H  3.360757 -2.045578 1.037705
H  -2.132639 -2.206183 -0.726488
H  1.943049 1.878344 -0.194028
H  -2.649981 1.831859 0.793614
H  4.095084 -2.516841 -1.338234
H  -3.921891 -1.778675 -2.462268
H  2.664163 1.412902 -2.534424
H  -4.432907 2.250843 -0.906806
