program: Gaussian 09
title: 000255510
version: EM64L-G09RevD.01
frameworkgroup: C1[X(C14H12N2O)]
method: RPBEPBE
basis: SDD
operation: Freq
keyword: #p
keyword: freq=noraman
keyword: PBEPBE/SDD
title: #p freq=noraman PBEPBE/SDD
converged: YES YES NO NO
title: Mulliken charges:
elementType: O N N C C C C C C C C C C C C C C H H H H H H H H H H H H
charge: -0.235285 -0.411900 -0.019115 0.377963 -0.698364 0.233102 0.474413 -0.410348 0.215843 -0.776063 -0.003685 -0.440801 -0.379507 -0.221722 -0.219676 -0.245850 -0.222897 0.238612 0.216921 0.269574 0.333540 0.282542 0.251558 0.222833 0.231611 0.242260 0.229962 0.231265 0.233212
chargesum: 0.00000
title: Mulliken charges with hydrogens summed into heavy atoms:
elementType: O N N C C C C C C C C C C C C C C
charge: -0.235285 -0.078360 -0.019115 0.377963 -0.242830 0.233102 0.474413 -0.140774 0.215843 -0.019130 -0.003685 -0.209190 -0.137247 0.008240 0.011590 -0.012638 -0.222897
polarizability: 2.36868169e+02 3.17175486e+01 1.47696325e+02 8.38957145e+00 3.59964850e+00 1.20240685e+02
1716.lowfreq: -11.4826 -0.0007 -0.0004 0.0006 1.2910 7.9935 15.1750 28.4621 43.8217
frequency: 11.9258 28.3573 43.7816 53.5584 86.3047 124.8182 149.7938 191.3656 216.1359 250.4823 292.5130 309.0864 330.6245 392.4986 404.3912 417.9639 440.1057 458.5315 513.6963 530.1231 565.5547 609.9495 619.2617 653.3026 694.9898 707.1101 717.0532 737.2522 743.7908 789.7533 800.9625 837.3398 856.6126 904.0872 942.9109 954.1613 980.0319 990.1194 999.7323 1007.8074 1026.1667 1036.6074 1068.0743 1083.9126 1144.2979 1173.1350 1184.9472 1189.6061 1205.0343 1220.2525 1265.8532 1290.2093 1321.0538 1336.3416 1365.3438 1381.4458 1405.5108 1438.1861 1441.8670 1454.4334 1466.0806 1478.6400 1483.9067 1555.9946 1589.7512 1592.9142 1612.2359 1648.0783 2177.9098 2975.8104 2986.8512 3022.7090 3070.8083 3095.7244 3112.5629 3123.5132 3135.2585 3135.8753 3146.5958 3164.8113 3495.7964
redmass: 2.4930 3.0008 2.1921 3.2874 3.8408 9.4036 6.3981 4.3895 4.0138 5.2369 2.5572 5.2160 3.8662 5.2909 2.8251 3.4350 8.6228 3.0751 5.8648 5.7043 4.9703 4.6230 5.7780 5.8714 4.7041 2.0270 6.1586 1.9349 1.8762 2.1797 3.4508 3.3157 1.2470 1.4680 1.5367 1.7396 1.3889 6.1682 1.3206 1.5451 2.2448 1.5322 5.6388 1.6781 3.0146 1.0690 1.5588 1.1135 2.2314 2.0459 2.7468 1.7619 1.5046 1.3170 4.5909 7.2552 1.2516 2.2892 2.2524 1.0950 1.1760 1.1968 1.9692 6.5253 4.4099 6.0118 6.0286 6.8192 12.6254 1.0602 1.0378 1.1004 1.0964 1.1003 1.0879 1.0863 1.0921 1.0912 1.0958 1.1014 1.0771
irintensity: 2.3074 0.3343 1.0740 0.7977 0.9658 1.6395 2.6512 3.3426 0.4829 0.8689 1.6035 2.2146 1.5558 1.8978 0.0246 6.0990 2.3189 8.0041 3.3895 7.1542 4.3851 2.6669 4.1624 3.9595 3.3660 42.7060 2.0886 22.3138 45.1501 65.2022 5.2206 0.1622 0.0303 7.9439 14.4054 8.0539 0.1101 1.2632 0.3972 18.7930 9.8203 13.4071 8.7293 14.5947 0.3399 0.4278 10.0970 1.0843 2.5294 1.8063 15.8926 7.2007 30.9607 2.4794 9.4117 0.9516 9.6157 26.4448 6.9176 7.5443 24.7287 17.9411 11.8815 126.4155 89.0855 4.7332 9.6368 455.3194 36.2676 26.2829 12.3902 10.3353 6.3873 11.3766 9.7382 3.8021 5.0714 7.2985 36.0041 22.9811 44.4403
temp: 298.150 k
press: 1.00000 atm
elementType: 8 7 7 6 6 6 6 6 6 6 6 6 6 6 6 6 6 1 1 1 1 1 1 1 1 1 1 1 1
symmnumber: 1
zpe: 588933.2 jmol-1
zpe.correction: 0.224313 hartree
zpe.thermalcorrener: 0.239464 hartree
zpe.thermalcorrenthalpy: 0.240408 hartree
zpe.thermalcorrgfe: 0.179020 hartree
zpe.sumelectzpe: -724.237008 hartree
zpe.sumelectthermal: -724.221857 hartree
zpe.sumelectthermalent: -724.220913 hartree
zpe.sumelectthermalfe: -724.282301 hartree
dipole: 8.7496 4.1389 1.5841
dipole: 9.8079
quadrupole: -135.2336 -96.2596 -95.6821
quadrupole: -8.5285 -6.1381 2.6475
quadrupole: -26.1752 12.7989 13.3763 -8.5285 -6.1381 2.6475
hfenergy: -724.461321 hartree
pointgroup: C01 [X(C14H12N2O1)]
dipole: -3.3023633 1.9946411 -0.0753918 debye
polarizability: 230.8914743|-39.2703512|153.7470485|-4.5907284|4.5674446|120.1666564 unknown
InChI: InChI=1S/C14H12N2O/c1-10-12(7-11-5-3-2-4-6-11)8-13(9-15)14(17)16-10/h2-6,8,16H,7H2,1H3
charge 0 multiplicity 1
29 atoms
O  4.102129 0.50526 1.056947
N  1.982472 1.390361 0.632038
N  4.290234 -2.580342 -1.055663
C  0.371963 0.414017 -0.853645
C  -0.993848 0.394334 -1.525992
C  0.733733 1.43325 0.04395
C  -2.172399 0.081478 -0.594622
C  1.331377 -0.611657 -1.110848
C  2.597741 -0.645419 -0.50819
C  -0.161305 2.594951 0.403318
C  3.003959 0.402204 0.437155
C  -3.400057 0.776662 -0.735625
C  -2.074512 -0.930767 0.394614
C  -4.507105 0.467751 0.087787
C  -3.178606 -1.242009 1.219221
C  -4.399756 -0.544016 1.069204
C  3.526436 -1.695824 -0.79886
H  -0.967658 -0.365661 -2.331753
H  -1.190039 1.360167 -2.032033
H  1.068051 -1.411324 -1.813216
H  2.255318 2.130443 1.28886
H  -1.138279 2.235211 0.770149
H  -0.361558 3.224131 -0.483997
H  0.287753 3.236932 1.180264
H  -3.492137 1.56198 -1.497094
H  -1.131196 -1.474778 0.522655
H  -5.448318 1.015235 -0.035437
H  -3.086998 -2.028365 1.976929
H  -5.255498 -0.785206 1.709282
