program: Gaussian 09
title: 000255508
version: EM64L-G09RevD.01
frameworkgroup: C1[X(C11H8Cl2O2)]
method: RPBEPBE
basis: SDD
operation: Freq
keyword: #p
keyword: freq=noraman
keyword: PBEPBE/SDD
title: #p freq=noraman PBEPBE/SDD
converged: YES YES NO NO
title: Mulliken charges:
elementType: Cl Cl O O C C C C C C C C C C C H H H H H H H H
charge: -0.011176 0.004835 -0.216444 -0.242853 -0.553235 0.173353 -0.300793 -0.345705 0.162572 0.503638 -0.376325 -0.393899 -0.093159 -0.224111 -0.113161 0.246125 0.252895 0.231628 0.235841 0.216812 0.254077 0.326328 0.262757
chargesum: 0.00000
title: Mulliken charges with hydrogens summed into heavy atoms:
elementType: Cl Cl O O C C C C C C C C C C C
charge: -0.011176 0.004835 -0.216444 -0.242853 -0.054215 0.173353 0.166675 -0.128893 0.162572 0.503638 -0.122248 -0.067570 -0.093159 0.038645 -0.113161
polarizability: 2.82596533e+02 -1.01140021e+01 1.41379289e+02 7.62540505e-01 1.41732112e-01 6.28022823e+01
1716.lowfreq: -8.0770 -5.1190 -0.0021 -0.0016 0.0010 2.7401 36.0399 45.6346 90.3706
frequency: 36.0216 45.6271 90.3632 104.3571 144.9135 167.3421 175.5250 199.4632 224.5613 245.3425 326.0551 336.4903 388.0652 421.0528 441.3139 486.0744 491.8219 575.5664 633.1602 649.8831 654.6389 702.2570 714.6729 729.5725 732.8490 838.3471 850.3256 872.3988 878.6250 931.3790 942.7140 995.4425 1000.5350 1010.2653 1021.0908 1056.1523 1127.2807 1151.8251 1167.2519 1171.5733 1195.0148 1225.6714 1268.0526 1287.7646 1339.5062 1350.7504 1392.2397 1418.7539 1456.1338 1461.9568 1486.5117 1547.4437 1586.1366 1639.3613 1660.7953 2993.1364 3024.8852 3068.8344 3072.3814 3113.1232 3148.7750 3151.6559 3170.3907
redmass: 5.8709 7.1034 4.1772 8.2874 4.4685 3.4241 20.0601 11.8235 5.1939 7.1304 5.2259 7.6305 3.5790 8.7291 3.0754 7.4149 7.9720 4.6215 7.5910 6.0781 3.6115 4.6679 5.0495 6.3781 5.9343 1.7845 1.3114 1.4489 4.4700 2.5686 1.9026 3.8867 5.5650 1.3246 4.8365 1.6419 2.2743 3.4707 1.2627 1.4930 1.3246 1.8051 1.5785 1.5257 1.3262 3.0324 3.8171 1.6063 1.0948 2.5200 1.0880 7.0602 6.4003 8.8354 9.6355 1.0646 1.0638 1.0936 1.0909 1.1062 1.0918 1.0923 1.0960
irintensity: 2.4982 4.7025 0.5011 4.2194 1.0723 5.2134 0.2808 2.8360 0.6540 4.9146 0.5313 2.3584 0.2015 2.7086 7.7790 27.2853 4.8654 2.8666 1.2786 14.0905 1.5607 3.0843 11.5600 13.8267 14.0076 9.5951 27.2517 7.0283 34.0270 21.2279 37.9826 218.1694 23.2385 7.9098 220.6060 10.6757 46.6231 157.9587 3.4713 25.6659 6.2512 28.3662 0.5974 16.1839 0.2682 6.1222 12.9742 53.8475 9.7007 89.6616 4.9622 31.8915 24.5884 129.2580 131.1715 16.8216 61.3716 5.0808 31.8297 27.2414 2.0370 40.4357 13.8331
temp: 298.150 k
press: 1.00000 atm
elementType: 17 17 8 8 6 6 6 6 6 6 6 6 6 6 6 1 1 1 1 1 1 1 1
symmnumber: 1
zpe: 423427.0 jmol-1
zpe.correction: 0.161275 hartree
zpe.thermalcorrener: 0.174573 hartree
zpe.thermalcorrenthalpy: 0.175517 hartree
zpe.thermalcorrgfe: 0.119541 hartree
zpe.sumelectzpe: -1493.456487 hartree
zpe.sumelectthermal: -1493.443189 hartree
zpe.sumelectthermalent: -1493.442245 hartree
zpe.sumelectthermalfe: -1493.498221 hartree
dipole: -2.9258 4.5397 0.0868
dipole: 5.4015
quadrupole: -100.5815 -99.2451 -101.1920
quadrupole: -20.9120 -0.8593 -0.1183
quadrupole: -0.2420 1.0945 -0.8525 -20.9120 -0.8593 -0.1183
hfenergy: -1493.6177621 hartree
pointgroup: C01 [X(C11H8Cl2O2)]
dipole: -1.4039481 1.2196781 -1.0283504 debye
dipolederiv: -0.3970945 -0.2475315 0.1870995 -0.3342586 -0.299139 0.2027656 0.2548384 0.2042351 -0.1920101 -0.9342654 0.1002381 -0.1354241 0.1534323 -0.0611425 0.0395031 -0.1930641 0.0374845 -0.0668082 -1.6023581 0.2492715 -0.035145 -0.032638 -0.4293347 0.0800032 0.1854758 0.0738183 -0.3765375 -0.771579 0.1991982 -0.0983683 0.0354182 -0.7028082 0.2736165 0.0709249 0.2964107 -0.5461775 -0.191159 -0.0313542 0.0773033 0.0315955 0.0780667 0.0802537 -0.174783 0.0952647 0.0216548 -0.4720613 -0.1506619 0.185776 -0.6006882 -0.2329795 0.133004 0.7695377 0.1613158 -0.2109691 0.5858103 -0.0632058 0.0188527 -0.2815446 0.4312538 0.030201 0.1870861 -0.046664 0.3238658 0.8577439 0.1351375 -0.0957296 -0.1283579 0.0284017 -0.1279713 0.1366563 -0.1300919 0.0385192 1.9228445 -0.3094097 0.0296428 0.5533751 0.8323447 -0.4579353 -0.8124107 -0.4505427 0.6776238 -0.3112945 -0.0011412 -0.0036823 0.1114662 0.0204861 0.0101217 -0.1468474 0.0039963 0.0114342 -0.000017 -0.1534132 0.132921 0.024239 -0.1069275 -0.0055489 -0.0262512 -0.0167089 -0.0958197 -0.0254969 0.0278356 -0.0089237 -0.1704565 -0.0945727 -0.0219988 0.1640182 -0.0145785 -0.0991834 0.2614538 0.524486 -0.418987 0.6656215 0.3818316 -0.3160955 -0.5306115 -0.311709 0.1981596 -0.3920572 -0.0050464 -0.012751 -0.1228024 -0.0166081 -0.0606888 0.0815746 -0.058918 -0.0375349 1.1331613 -0.2843059 0.3132696 -0.2534292 -0.0105177 -0.0460815 0.298745 -0.0511876 0.0119137 0.0349688 -0.0244261 0.011059 0.0680628 -0.1001194 0.0579183 0.0171499 0.0417215 0.0796591 -0.0322787 -0.0135135 -0.036641 0.00245 0.0592603 -0.0883951 -0.0770685 -0.0570265 -0.0717545 0.045803 0.023521 0.0081887 0.1573421 -0.074808 -0.0796735 0.0551785 -0.0837919 -0.0447613 -0.1373999 -0.0271884 -0.0495328 -0.0405741 0.0473237 -0.0133021 -0.1157143 -0.000861 0.0581449 0.0465044 -0.0084092 0.0060455 0.0557552 0.0053256 0.1105462 -0.0361357 0.1070522 0.0141004 0.0674933 0.0488937 -0.0490707 0.0308856 0.0596667 0.0842832 -0.0326344 0.0860552 0.0831743 0.2575563 -0.0079608 -0.0036233 0.044514 0.1260784 0.0295512 -0.0408867 0.0298894 0.1349658 0.053722 0.0189863 -0.0222792 0.030592 0.058918 0.0859231 -0.0347781 0.0848361 0.0883407 unknown
polarizability: 282.372295|11.1817819|108.7109011|-3.9527891|-38.7802625|95.6949081 unknown
InChI: InChI=1S/C11H8Cl2O2/c12-9-2-1-7(6-10(9)13)5-8-3-4-15-11(8)14/h1-2,5-6H,3-4H2
charge 0 multiplicity 1
23 atoms
Cl 3.940803 1.733487 -1.693605
Cl 4.930288 -0.640781 0.36581
O  -3.947627 -1.238475 0.80131
O  -1.823418 -2.059007 1.189611
C  -3.539507 0.330199 -0.989374
C  -2.218403 -0.182073 -0.422448
C  -4.574895 -0.093079 0.078389
C  -0.999651 0.303199 -0.834492
C  -2.545553 -1.239163 0.584173
C  0.398453 0.005431 -0.489225
C  1.38318 0.829307 -1.115281
C  0.846347 -1.020809 0.397024
C  2.752252 0.645523 -0.864741
C  2.220167 -1.199841 0.641141
C  3.178343 -0.371206 0.017309
H  -3.542532 1.419391 -1.162181
H  -3.758178 -0.166656 -1.954133
H  -4.766725 0.702414 0.820021
H  -5.527166 -0.45764 -0.334603
H  -1.080369 1.103164 -1.588335
H  1.077156 1.624506 -1.803662
H  0.11614 -1.673788 0.882054
H  2.560294 -1.988401 1.318835
