program: Gaussian 09
title: 000255507
version: EM64L-G09RevD.01
frameworkgroup: C1[X(C11H9Cl2NO2)]
method: RPBEPBE
basis: SDD
operation: Freq
keyword: #p
keyword: freq=noraman
keyword: PBEPBE/SDD
title: #p freq=noraman PBEPBE/SDD
converged: YES YES NO NO
title: Mulliken charges:
elementType: Cl Cl O O N C C C C C C C C C C C H H H H H H H H H
charge: -0.020023 -0.006543 -0.214816 -0.285856 -0.666201 -0.544286 0.113138 -0.304922 -0.280632 0.362569 0.189035 0.295180 -0.329992 -0.390560 -0.172003 -0.080556 0.242367 0.250437 0.233524 0.236971 0.203940 0.245498 0.247384 0.373673 0.302673
chargesum: 0.00000
title: Mulliken charges with hydrogens summed into heavy atoms:
elementType: Cl Cl O O N C C C C C C C C C C C
charge: -0.020023 -0.006543 -0.214816 -0.285856 0.010146 -0.051482 0.113138 0.165573 -0.076692 0.362569 0.189035 0.295180 -0.084494 -0.143176 -0.172003 -0.080556
polarizability: 3.07265083e+02 1.02937760e+01 1.58699893e+02 2.46833125e+00 -1.04821517e+00 7.11484374e+01
1716.lowfreq: -4.6754 -0.0027 -0.0024 -0.0017 6.1831 6.7832 28.9814 36.8082 67.3354
frequency: 28.9551 36.7581 67.3288 113.8833 143.8971 164.7302 169.1829 180.2763 221.7661 245.9124 262.9060 299.3205 340.0280 375.8693 392.8167 440.6445 460.3871 478.1631 522.0667 538.4061 612.1078 619.7471 658.0629 666.4399 691.0186 697.6063 719.6065 729.7633 808.4962 839.7392 843.8419 848.5451 866.0761 914.7447 924.0072 942.0462 1005.7531 1035.9322 1052.5911 1091.6138 1138.2277 1157.9059 1171.4831 1193.0181 1223.6114 1262.3972 1275.9779 1298.9768 1340.7223 1392.2450 1409.9572 1440.5952 1460.7138 1478.4092 1484.6409 1527.1124 1596.1164 1616.7921 1632.7607 1697.8556 2992.6133 3027.8460 3057.9442 3066.1328 3114.9069 3123.5988 3144.8702 3153.3257 3590.2498
redmass: 6.7868 6.1640 5.0978 4.1099 6.8823 6.2993 4.4449 16.6551 6.3039 7.3905 5.1924 6.1443 5.1283 8.2844 3.5093 4.8275 4.3112 4.4886 1.4192 2.8944 7.6901 7.9269 3.5838 6.8149 5.0003 4.9967 5.4647 4.2616 4.3091 1.4425 1.6779 1.3929 1.3788 1.6388 5.1306 4.0828 3.1882 6.1965 1.6317 1.8677 1.9127 2.7505 1.2726 1.4737 1.8298 3.3722 1.3632 1.5488 1.3461 5.2644 2.9557 1.6990 1.0916 3.4953 1.1066 6.6160 7.6198 7.3989 8.5188 1.1631 1.0641 1.0640 1.0866 1.0966 1.1067 1.0755 1.0913 1.0917 1.0825
irintensity: 5.0366 0.8693 0.3905 0.2158 2.0314 2.6815 6.6019 0.1519 5.2215 3.5196 0.2168 6.8669 0.3786 11.4449 5.8430 2.6256 16.5971 29.9572 37.0410 21.0950 11.5801 6.2554 7.0543 8.9279 12.5451 6.4502 4.5626 6.5594 4.4904 148.6649 40.9101 29.2026 11.0091 70.8724 45.4406 49.9164 93.0278 358.9280 20.5785 11.4688 18.1488 197.0491 35.1933 41.6177 14.9879 73.5477 23.5447 1.4333 0.6007 102.2270 3.8397 40.9838 13.2392 49.2807 10.8654 213.4419 40.0509 368.5989 233.4745 68.5595 22.4998 62.6030 8.8134 29.5915 26.9097 361.3891 2.2867 2.6108 46.4377
temp: 298.150 k
press: 1.00000 atm
elementType: 17 17 8 8 7 6 6 6 6 6 6 6 6 6 6 6 1 1 1 1 1 1 1 1 1
symmnumber: 1
zpe: 467273.6 jmol-1
zpe.correction: 0.177975 hartree
zpe.thermalcorrener: 0.192434 hartree
zpe.thermalcorrenthalpy: 0.193378 hartree
zpe.thermalcorrgfe: 0.134805 hartree
zpe.sumelectzpe: -1548.734135 hartree
zpe.sumelectthermal: -1548.719676 hartree
zpe.sumelectthermalent: -1548.718732 hartree
zpe.sumelectthermalfe: -1548.777305 hartree
dipole: 3.0286 2.3909 1.6893
dipole: 4.2122
quadrupole: -113.4109 -96.7338 -109.5025
quadrupole: 21.4834 5.3091 -2.4857
quadrupole: -6.8619 9.8153 -2.9534 21.4834 5.3091 -2.4857
hfenergy: -1548.9121097 hartree
pointgroup: C01 [X(C11H9Cl2N1O2)]
dipole: -1.3403153 0.2412477 -0.944296 debye
dipolederiv: -0.338208 -0.2474997 0.1259557 -0.3992634 -0.4127384 0.1997393 0.2194789 0.2028692 -0.137769 -0.9585069 0.0333549 -0.0412677 0.1342669 -0.0726437 0.0230644 -0.1091587 0.0139194 -0.0440328 -1.7365637 0.2693182 -0.1233663 0.0660604 -0.3996148 0.0986672 0.086639 0.0849796 -0.402783 -0.6924435 0.1854191 -0.1739406 0.0456149 -0.5890271 0.311244 0.3348494 0.3207857 -0.79389 -0.4739873 -0.5924338 0.2219357 -0.1724403 -1.0165991 0.1672754 0.1020838 -0.0075696 -0.5427444 -0.1246086 -0.0073419 0.0826971 0.0014853 0.1204707 0.0559743 -0.1510985 0.08345 0.0178323 -1.0091772 -0.0564494 0.2614737 -0.7338112 -0.1530071 0.121694 1.0835002 0.0557221 -0.289228 0.5615906 -0.0606367 0.0464878 -0.2930404 0.4297813 -0.004898 0.307207 -0.0800925 0.3433164 1.5293375 -0.0269432 -0.1230302 -0.0024187 -0.0077423 -0.1019734 0.0828147 -0.0931156 0.0695523 -1.0847859 0.1798307 -0.0141661 -0.1739342 -0.2295183 0.0788567 -0.1244167 0.0982668 -0.0976051 2.0608351 -0.2930861 0.1131299 0.5501413 0.6063579 -0.5014233 -1.1541639 -0.4148198 0.9657177 0.3436895 0.6621772 -0.2534118 0.0653733 0.8247659 -0.2800364 0.1044322 -0.3143056 0.2414413 0.6655098 -0.1673996 0.071592 0.3297306 -0.0951456 0.0081919 -0.2675773 0.0036384 -0.0631233 -0.3252451 -0.4306535 0.1779889 -0.030721 -0.188053 0.0035744 -0.0195228 0.0411094 -0.1693514 -0.4663633 0.6088204 -0.3058953 0.8671976 0.3870248 -0.2816158 -0.50028 -0.2398581 0.028434 1.2494584 -0.1535031 0.1299739 -0.5809657 0.3372289 -0.1573285 0.3899294 -0.1884079 0.0818097 0.0565254 -0.0449211 0.0269596 0.0661994 -0.081969 0.0889516 -0.0073162 0.0662832 0.0541609 -0.032753 -0.0049036 -0.0421785 -0.0006052 0.0244999 -0.1064445 -0.1001674 -0.0670318 -0.0615547 0.0546087 0.0205773 0.0075106 0.1710919 -0.1079742 -0.0569717 0.0160039 -0.0690845 -0.0103746 -0.126458 -0.0278795 -0.0577299 -0.0552991 0.0508357 -0.015099 -0.1247096 0.0029151 0.0497787 0.0645441 -0.0100761 -0.0055123 0.1336935 0.0099462 0.106186 0.0314317 0.0915455 -0.0080764 0.059864 0.0678914 -0.0499859 0.0362952 0.0374135 0.0643217 -0.0135954 0.0713742 0.1041405 0.0525037 -0.0021476 -0.006314 0.0373612 -0.0010533 0.0942338 -0.0312896 0.0914288 0.1151943 0.5450368 0.0290934 -0.0578586 -0.0860395 0.2584474 0.0444118 -0.1375378 0.1635292 0.2681805 0.1255968 0.0693924 -0.0110476 0.0240275 0.2683137 0.0394041 -0.0175362 0.0824685 0.2809742 unknown
polarizability: 306.5607126|11.4923685|132.7279197|-9.0658736|-40.5678791|97.8247811 unknown
InChI: InChI=1S/C11H9Cl2NO2/c12-8-4-7(10(14)5-9(8)13)3-6-1-2-16-11(6)15/h3-5H,1-2,14H2
charge 0 multiplicity 1
25 atoms
Cl 3.70575 2.195467 -1.512036
Cl 5.031963 -0.437664 -0.01475
O  -4.190018 -0.796625 0.873029
O  -2.190902 -1.635206 1.634837
N  0.257546 -2.252811 0.722271
C  -3.517718 0.330647 -1.154654
C  -2.290554 -0.15933 -0.380401
C  -4.670024 0.198754 -0.134686
C  -1.014922 0.212365 -0.769755
C  0.387461 -0.04495 -0.428615
C  -2.792501 -0.936583 0.776938
C  0.984759 -1.193392 0.23408
C  1.286569 0.947512 -0.947706
C  2.415083 -1.26115 0.325557
C  2.674367 0.871102 -0.827567
C  3.240367 -0.259886 -0.186836
H  -3.408259 1.365806 -1.520267
H  -3.700031 -0.318882 -2.03193
H  -4.869469 1.139259 0.408025
H  -5.606322 -0.199094 -0.553271
H  -1.062461 0.94138 -1.59542
H  0.863728 1.815363 -1.465398
H  2.872972 -2.122385 0.822679
H  -0.726738 -2.125908 1.040036
H  0.770351 -3.041789 1.115641
