program: Gaussian 09
title: 000255506
version: EM64L-G09RevD.01
frameworkgroup: C1[X(C11H7Cl2NO4)]
method: RPBEPBE
basis: SDD
operation: Freq
keyword: #p
keyword: freq=noraman
keyword: PBEPBE/SDD
title: #p freq=noraman PBEPBE/SDD
converged: YES YES NO NO
title: Mulliken charges:
elementType: Cl Cl O O O O N C C C C C C C C C C C H H H H H H H
charge: 0.038809 0.031929 -0.209960 -0.240428 -0.187618 -0.204616 0.009556 -0.555232 0.163275 -0.301945 -0.315867 0.420747 0.175742 0.213818 -0.295187 -0.364732 -0.174939 -0.104992 0.260097 0.256492 0.238333 0.240392 0.256617 0.340388 0.309320
chargesum: 0.00000
title: Mulliken charges with hydrogens summed into heavy atoms:
elementType: Cl Cl O O O O N C C C C C C C C C C C
charge: 0.038809 0.031929 -0.209960 -0.240428 -0.187618 -0.204616 0.009556 -0.038642 0.163275 0.176780 -0.059250 0.420747 0.175742 0.213818 0.045201 -0.055412 -0.174939 -0.104992
polarizability: 2.86781954e+02 4.74188250e+00 1.97400236e+02 -9.23993220e-01 9.73934310e-01 7.09978893e+01
1716.lowfreq: -0.0032 -0.0026 -0.0025 1.7867 4.2787 6.2678 22.4952 39.7461 49.8403
frequency: 22.3529 39.7422 49.8388 63.5081 94.8887 109.3256 162.1786 172.7855 180.4216 189.0856 218.4969 248.0388 251.5765 303.6933 326.7536 371.9372 389.0262 427.9842 449.9542 483.3654 519.4852 555.3992 603.1602 645.4790 652.1725 673.8500 680.8082 690.8900 718.8586 738.9538 751.8454 802.4254 842.2088 894.7227 903.1523 911.2835 935.5891 960.4306 998.3373 1024.0669 1055.5629 1068.9427 1130.9644 1155.7808 1168.1136 1192.7256 1196.5893 1212.4572 1281.8212 1286.0211 1336.7604 1338.8239 1347.8662 1388.8846 1426.8264 1453.3408 1460.0702 1485.9649 1531.3201 1582.3091 1637.3947 1651.4301 2994.6261 3031.9955 3080.0230 3106.4131 3121.0526 3140.8570 3188.8001
redmass: 6.9804 8.3636 13.9667 7.3389 10.4591 4.8629 7.1141 3.5620 12.9155 9.3003 7.4996 8.3828 5.5419 17.6447 6.3570 5.8984 5.1072 9.8936 3.8538 8.2436 7.1461 6.1954 7.9357 7.0602 3.3541 7.5731 6.1941 9.0224 6.9655 4.9941 7.8451 7.8346 1.7611 1.4836 2.4073 2.2954 4.0182 1.3652 3.3555 5.5982 1.7014 5.4914 2.1691 3.3982 1.1893 2.6140 3.1759 2.5092 1.3535 1.4662 3.7140 1.6006 3.6782 10.7439 1.6579 1.0923 2.5801 1.0881 7.8845 7.2075 8.7869 9.5083 1.0656 1.0631 1.0970 1.0957 1.1068 1.0869 1.0924
irintensity: 6.2470 3.3564 1.1401 0.3737 2.9987 0.6961 2.1321 7.7273 0.7094 1.9486 5.7627 0.3858 0.8696 0.5235 0.8737 0.6725 3.8456 5.5293 7.8724 9.3484 13.0631 7.1705 1.9035 10.9209 4.4722 28.9223 0.3747 11.1790 14.5586 2.0087 4.6966 15.6219 10.0716 17.7177 46.4952 34.6256 14.0189 33.1050 126.6095 166.7036 34.1576 40.0261 107.0566 103.7452 4.4145 96.2102 232.6881 54.7757 14.2678 6.2722 31.3057 10.8812 122.7840 32.4647 3.7372 15.8272 171.3872 4.8712 58.8256 45.0299 29.2228 102.8881 10.1049 52.9245 12.0393 106.8554 23.4863 10.7531 8.9826
temp: 298.150 k
press: 1.00000 atm
elementType: 17 17 8 8 8 8 7 6 6 6 6 6 6 6 6 6 6 6 1 1 1 1 1 1 1
symmnumber: 1
zpe: 425343.1 jmol-1
zpe.correction: 0.162005 hartree
zpe.thermalcorrener: 0.178053 hartree
zpe.thermalcorrenthalpy: 0.178997 hartree
zpe.thermalcorrgfe: 0.115852 hartree
zpe.sumelectzpe: -1697.746857 hartree
zpe.sumelectthermal: -1697.730809 hartree
zpe.sumelectthermalent: -1697.729865 hartree
zpe.sumelectthermalfe: -1697.793010 hartree
dipole: 2.9891 1.5754 1.0026
dipole: 3.5245
quadrupole: -97.6726 -142.5040 -115.2879
quadrupole: 12.2282 4.1835 -0.3424
quadrupole: 20.8155 -24.0158 3.2003 12.2282 4.1835 -0.3424
hfenergy: -1697.9088617 hartree
pointgroup: C01 [X(C11H7Cl2N1O4)]
dipole: -1.1956015 -0.3775658 0.5922393 debye
dipolederiv: -0.1903571 -0.246468 0.0659398 -0.3756974 -0.6238901 0.150978 0.0846535 0.1350781 -0.0374679 -0.9079897 -0.0103908 0.119616 -0.0199157 -0.0263846 0.0046154 0.1397672 -0.001232 -0.0255739 -1.5291987 -0.0521157 0.0271118 0.301875 -0.4666029 0.0421334 -0.1167038 0.0649302 -0.3217687 -0.8731622 -0.1692794 0.069573 -0.0365034 -0.7579773 0.1360084 -0.0533303 0.1954549 -0.3697287 -0.5232699 0.217159 -0.1585248 0.2074715 -0.8530092 0.2004581 -0.1418636 0.1902021 -0.3041497 -0.7339899 -0.2060838 -0.1286498 -0.1183633 -0.6050453 0.045865 -0.104082 0.0568442 -0.2596155 0.9937452 0.2258885 0.3161381 0.021845 1.7642716 -0.3567631 0.2751838 -0.3695065 0.3537735 -0.2587678 0.1028657 -0.020654 -0.0492989 0.007431 0.086566 0.2164894 0.0444179 0.0486939 0.0054626 0.0912417 -0.1175967 0.5881325 -0.385049 0.0642595 -0.4275227 0.1796695 -0.0614249 0.6341103 0.0273946 -0.0067843 0.239224 0.3670328 0.047755 -0.0983573 0.0013655 0.3293486 0.237572 -0.0711902 -0.0045025 0.1021165 0.0566413 -0.0912591 -0.0996983 -0.0069874 -0.0366586 0.1228678 -0.254033 0.0059637 0.1009904 0.2237779 -0.0264517 -0.0625004 -0.0633572 0.0582426 1.805458 0.1275692 -0.0420652 -0.7942691 1.1139403 -0.2420696 0.4510527 -0.3739961 0.3710094 0.1777024 -0.3143844 -0.024804 -0.1760225 -0.6377576 0.1396841 0.020254 0.1352812 -0.0133239 -0.4691508 -0.2096421 0.0750208 -0.0864453 -0.2887443 0.0639696 0.050261 0.0650551 -0.0576136 -0.4570653 0.3713551 -0.0124654 -0.272909 0.1345584 -0.0033367 0.1234643 -0.0086333 -0.0518402 0.2453461 0.4253611 -0.1047107 0.5108326 1.0500987 -0.2433279 -0.1142871 -0.2450062 0.0150713 1.2902928 -0.0324123 -0.1739694 0.2239037 -0.4326257 0.0390181 -0.2265589 0.0750445 -0.0281403 0.0423952 0.0143621 0.0003742 -0.061371 -0.0793231 0.0030791 -0.0428044 -0.0055088 0.1002511 -0.0111965 0.0242589 0.0254833 -0.0036476 0.091276 -0.0479731 0.0358232 -0.0192819 -0.0887768 0.0218251 -0.0254997 -0.0252731 -0.1267085 0.0087032 -0.058256 -0.1076145 -0.051446 -0.0803913 -0.10859 0.0403196 0.0556581 0.0371738 0.0466863 -0.0259174 0.1197441 -0.0249147 0.0523411 0.0649537 -0.0205006 0.021334 -0.0895981 0.0506597 0.0599839 0.0338157 0.0203074 0.0936609 0.3128527 -0.0466896 0.0205295 -0.1467065 0.1417707 0.0061842 0.0673657 0.0060332 0.1418149 0.1081542 -0.009086 0.0172573 0.0238913 0.0995609 0.004797 -0.0225511 0.000186 0.1722667 unknown
polarizability: 285.2368682|-8.520707|191.8705229|-16.773008|-25.7141239|78.0726879 unknown
InChI: InChI=1S/C11H7Cl2NO4/c12-8-4-7(3-6-1-2-18-11(6)15)10(14(16)17)5-9(8)13/h3-5H,1-2H2
charge 0 multiplicity 1
25 atoms
Cl 2.965226 2.836653 -0.644876
Cl 4.892619 0.180817 -0.458262
O  -3.694008 2.281637 -0.306405
O  -1.449939 2.795988 -0.463521
O  1.529647 -3.521773 1.017131
O  -0.539222 -2.978719 0.241189
N  0.680779 -2.670621 0.545986
C  -3.622672 0.203297 0.91542
C  -2.22126 0.595162 0.459263
C  -4.539187 1.101974 0.054441
C  -1.1503 -0.25478 0.598442
C  0.278566 -0.140711 0.261634
C  -2.328088 1.964966 -0.145725
C  1.155979 -1.279987 0.311535
C  0.898364 1.107348 -0.037849
C  2.54703 -1.17086 0.107367
C  2.280479 1.216134 -0.262727
C  3.116091 0.077205 -0.183621
H  -3.834769 -0.869337 0.776904
H  -3.753234 0.440268 1.989004
H  -4.846632 0.614242 -0.886852
H  -5.420839 1.493083 0.582646
H  -1.418314 -1.223182 1.033393
H  0.273157 2.004907 -0.101201
H  3.166925 -2.067907 0.17188
