program: Gaussian 09
title: 000255505
version: EM64L-G09RevD.01
frameworkgroup: C1[X(C14H19NO3)]
method: RPBEPBE
basis: SDD
operation: Freq
keyword: #p
keyword: freq=noraman
keyword: PBEPBE/SDD
title: #p freq=noraman PBEPBE/SDD
converged: YES YES NO NO
title: Mulliken charges:
elementType: O O O N C C C C C C C C C C C C C C H H H H H H H H H H H H H H H H H H H
charge: -0.228759 -0.289304 -0.440171 -0.325175 -0.016886 -0.414955 -0.425160 -0.347177 -0.424604 -0.604462 0.114397 0.342417 -0.464451 -0.374029 0.212626 -0.364786 0.183983 -0.520448 0.211914 0.188924 0.238250 0.211914 0.194341 0.186027 0.203138 0.174279 0.208057 0.242764 0.252464 0.225414 0.273836 0.279676 0.220552 0.366058 0.262976 0.213224 0.233137
chargesum: 0.00000
title: Mulliken charges with hydrogens summed into heavy atoms:
elementType: O O O N C C C C C C C C C C C C C C
charge: -0.228759 -0.289304 -0.074113 -0.082411 0.195028 0.012219 -0.018905 0.041987 -0.042268 -0.126584 0.114397 0.342417 -0.190616 -0.094354 0.212626 -0.144234 0.183983 0.188889
polarizability: 2.49403207e+02 7.41036665e+00 1.68757710e+02 5.48689624e+00 -1.52575557e+00 1.06344562e+02
1716.lowfreq: 0.0004 0.0006 0.0007 1.9775 4.6384 10.3965 25.6968 35.7749 50.9800
frequency: 25.6091 35.5704 50.9685 57.8543 88.8623 105.2865 122.9320 130.2382 182.4027 198.2047 230.9116 234.3368 266.8556 297.0683 307.6472 332.5537 346.2991 370.0337 373.3897 420.4750 436.1636 451.6597 459.5708 493.0713 511.2326 559.5980 580.5123 620.8091 637.1894 676.4032 722.8688 730.8008 758.8368 801.2117 812.8194 828.7325 851.6889 863.8688 877.6652 905.7042 930.4289 953.6112 964.4980 968.3151 989.3375 1015.8040 1063.7099 1071.7770 1074.9653 1097.3673 1112.6080 1115.5429 1133.8434 1153.3670 1155.4005 1156.8407 1175.0995 1187.4854 1215.5757 1238.1345 1258.1941 1261.6048 1264.8950 1277.0312 1304.8872 1309.6832 1327.7857 1335.4242 1343.0855 1361.2178 1372.9337 1394.7586 1403.1618 1426.9453 1438.7029 1448.0240 1455.2327 1456.8823 1458.1884 1464.3222 1475.2730 1479.5807 1497.4458 1566.9154 1597.3875 1612.1230 2847.0915 2873.6942 2946.8913 2967.5336 2979.1427 2979.3651 2984.3929 3018.0614 3027.0281 3032.9275 3050.1697 3063.7695 3089.5459 3109.7434 3132.1442 3165.3551 3168.1544 3415.5801 3573.8595
redmass: 4.3553 3.5558 3.0221 2.6086 4.0584 5.5029 2.9468 1.9968 2.6139 2.8985 2.7370 2.8586 4.1851 5.1621 2.8864 2.0408 3.5756 1.2978 5.4863 4.2279 3.2474 2.7386 3.3069 2.0696 3.5382 2.0820 3.9527 5.8336 3.5842 1.9087 4.5794 3.7061 4.3245 2.3656 1.5321 1.5558 2.6289 4.7824 1.6397 1.6027 2.1662 1.8179 2.5696 1.7308 3.0322 2.1969 2.0859 1.6904 1.9777 1.6535 1.2381 1.9469 2.7487 1.3239 1.4736 1.2056 1.5921 1.6188 1.8281 1.7766 1.2864 1.9562 1.4364 1.4114 1.6684 1.2986 1.3765 1.4091 1.5050 1.7508 1.4651 3.1068 6.7587 1.1144 1.3018 1.1356 1.2816 1.0640 1.0903 1.0938 1.0893 1.0544 3.1715 7.2509 7.0739 7.2039 1.0709 1.0808 1.0650 1.0624 1.0356 1.0629 1.0612 1.0921 1.0903 1.0957 1.1029 1.0997 1.0972 1.0900 1.1048 1.0920 1.0932 1.0745 1.0660
irintensity: 1.8704 1.0472 1.7512 3.9755 2.5353 0.5734 1.9199 7.0390 1.4289 4.2596 0.7733 3.6811 4.5701 8.3071 6.5585 1.5798 15.8956 114.9180 15.6766 4.1677 1.9923 9.6997 4.5829 6.6514 3.5220 30.7500 8.9991 30.3560 9.8972 48.1948 28.6504 2.6896 1.8074 10.1660 35.6492 3.8449 3.1162 12.8713 16.0411 12.8783 9.8785 1.6966 58.1848 28.9770 37.8964 18.9484 13.4253 76.4141 109.1847 12.1762 5.6238 4.7870 17.6937 13.0892 11.0946 17.4092 22.0044 15.4447 162.7388 51.3713 3.7734 102.0677 111.2812 138.8979 64.7994 49.7804 58.1288 2.7640 10.2979 67.9768 1.0139 28.6163 0.7470 23.4149 16.4372 12.7167 2.4097 13.3168 9.2464 9.1605 5.2956 26.8530 21.5953 248.0180 11.1126 41.2216 121.1820 51.6681 36.9311 36.7764 62.2993 45.7757 39.3935 17.8897 66.9061 64.5675 60.5053 34.2332 35.6396 19.4503 14.4030 4.9582 1.6641 5.8567 59.0943
temp: 298.150 k
press: 1.00000 atm
elementType: 8 8 8 7 6 6 6 6 6 6 6 6 6 6 6 6 6 6 1 1 1 1 1 1 1 1 1 1 1 1 1 1 1 1 1 1 1
symmnumber: 1
zpe: 804774.3 jmol-1
zpe.correction: 0.306522 hartree
zpe.thermalcorrener: 0.324314 hartree
zpe.thermalcorrenthalpy: 0.325258 hartree
zpe.thermalcorrgfe: 0.259606 hartree
zpe.sumelectzpe: -823.915519 hartree
zpe.sumelectthermal: -823.897727 hartree
zpe.sumelectthermalent: -823.896783 hartree
zpe.sumelectthermalfe: -823.962435 hartree
dipole: 3.3683 0.1471 0.6030
dipole: 3.4250
quadrupole: -84.1725 -108.2009 -106.7890
quadrupole: -10.9020 8.3706 0.5574
quadrupole: 15.5483 -8.4801 -7.0682 -10.9020 8.3706 0.5574
hfenergy: -824.222041 hartree
pointgroup: C01 [X(C14H19N1O3)]
dipole: -1.3213026 -0.1137945 0.2387063 debye
polarizability: 248.6033685|10.8410894|169.5647463|-5.6956814|0.8866029|106.337364 unknown
InChI: InChI=1S/C14H19NO3/c1-18-14-8-10(5-6-12(14)16)13(17)9-11-4-2-3-7-15-11/h5-6,8,11,15-16H,2-4,7,9H2,1H3
charge 0 multiplicity 1
37 atoms
O  0.910028 2.096272 -0.202856
O  -3.422307 -2.166961 -0.074712
O  -5.221503 0.083299 0.078178
N  3.654204 -1.168766 -0.679299
C  2.891646 0.045444 -0.278578
C  3.368419 0.49365 1.123999
C  4.899064 0.71754 1.149031
C  5.645407 -0.542601 0.650958
C  5.120243 -0.954475 -0.739988
C  1.390626 -0.298991 -0.298825
C  0.457772 0.91058 -0.192218
C  -1.019503 0.666804 -0.097605
C  -1.583379 -0.635943 -0.079871
C  -1.888548 1.788222 -0.021664
C  -2.97628 -0.839178 -0.000873
C  -3.277906 1.603065 0.055494
C  -3.834215 0.300031 0.052451
C  -4.448887 -2.617708 0.890652
H  3.069439 0.899487 -0.978831
H  3.100771 -0.299002 1.851962
H  2.836864 1.419575 1.405925
H  5.229332 0.986781 2.170409
H  5.153011 1.575913 0.492655
H  6.735809 -0.357385 0.597824
H  5.47605 -1.379014 1.356391
H  5.403492 -0.156254 -1.473998
H  5.598997 -1.895802 -1.068586
H  3.292722 -1.566101 -1.558686
H  1.174142 -1.020405 0.513639
H  1.13751 -0.830465 -1.243145
H  -0.959852 -1.533264 -0.130542
H  -1.446799 2.789162 -0.028941
H  -3.947418 2.472684 0.103728
H  -5.708501 0.944884 0.069072
H  -5.396751 -2.075942 0.745246
H  -4.087702 -2.479255 1.927933
H  -4.576498 -3.690081 0.679766
