program: Gaussian 09
title: 000255502
version: EM64L-G09RevD.01
frameworkgroup: C1[X(C16H26N4O6S)]
method: RPBEPBE
basis: SDD
operation: Freq
keyword: #p
keyword: freq=noraman
keyword: PBEPBE/SDD
title: #p freq=noraman PBEPBE/SDD
converged: YES YES NO NO
title: Mulliken charges:
elementType: S O O O O O O N N N N C C C C C C C C C C C C C C C C H H H H H H H H H H H H H H H H H H H H H H H H H H
charge: 0.217142 -0.194818 -0.220243 -0.231816 -0.229737 -0.270263 -0.254708 -0.380001 -0.384353 0.092145 0.105727 -0.500783 -0.585661 -0.645899 -0.664462 0.251571 0.356870 -0.027523 -0.006805 -0.774784 -0.790194 0.211568 0.220049 -0.253892 -0.254176 -0.668691 -0.664212 0.280813 0.280929 0.252981 0.231481 0.207963 0.255706 0.258022 0.202927 0.388167 0.318706 0.241428 0.253896 0.278444 0.306467 0.238025 0.235815 0.227565 0.225030 0.233371 0.233050 0.212120 0.234303 0.247229 0.222115 0.245863 0.235533
chargesum: 0.00000
title: Mulliken charges with hydrogens summed into heavy atoms:
elementType: S O O O O O O N N N N C C C C C C C C C C C C C C C C
charge: 0.217142 -0.194818 -0.220243 -0.231816 -0.229737 -0.270263 -0.254708 0.008166 -0.065647 0.092145 0.105727 -0.219970 -0.304732 0.046526 0.052193 0.251571 0.356870 -0.027523 -0.006805 -0.001016 -0.009886 0.211568 0.220049 0.198703 0.212245 0.024961 0.039300
polarizability: 3.40380323e+02 -3.88889327e+00 3.08526980e+02 1.24679482e+01 1.23518254e+01 1.83339799e+02
1716.lowfreq: -6.6462 -2.9829 -1.1571 -0.0013 -0.0012 -0.0011 4.2676 13.6672 17.6482
frequency: -4.9997 13.5750 17.4987 22.9279 33.6776 39.5499 45.1726 54.1368 63.6710 72.7734 79.6145 83.7072 87.0708 88.2445 104.6971 114.2025 122.3058 130.8358 155.5658 168.5095 192.4982 195.6292 197.5527 204.9689 211.4679 221.2276 238.1967 245.3066 255.0769 276.9463 281.1040 287.3734 302.7970 307.5775 316.2013 339.2489 345.7305 359.6714 367.2421 377.8884 391.8736 448.6989 458.9578 484.7228 506.1026 509.7366 533.0029 546.1680 594.3107 626.6403 649.6721 660.8256 690.2975 696.9085 709.2561 711.0276 723.0472 736.9685 764.3812 768.2918 818.0974 819.1012 835.2093 837.6062 854.4380 913.9283 919.7912 964.8829 973.7551 985.4176 992.8806 1009.2353 1014.2889 1031.4336 1034.8098 1050.4315 1054.2103 1065.2857 1068.1447 1093.9699 1094.8702 1099.9246 1107.3054 1112.2825 1131.0577 1145.7236 1152.0072 1158.1027 1158.2675 1203.6146 1227.2159 1272.5182 1278.3060 1278.8605 1286.0446 1294.7739 1303.3111 1358.4278 1359.0438 1386.6184 1389.1064 1389.6674 1391.6509 1395.7995 1401.0999 1441.1751 1451.9091 1455.1866 1455.4306 1457.5453 1461.6362 1463.2980 1463.7542 1463.8349 1478.8229 1484.1627 1484.5388 1484.7905 1488.9956 1503.0485 1543.0424 1552.5112 1564.1441 1585.9998 1589.4537 1630.6944 1652.3047 2966.3407 2983.1242 2989.6688 2992.4030 2995.2832 2996.3225 2998.2255 3026.3819 3032.9204 3035.0108 3040.2724 3057.1682 3083.7089 3087.6947 3090.2975 3090.8431 3093.0684 3098.0209 3106.4804 3115.0980 3117.6244 3118.6963 3123.8869 3124.3481 3238.6925 3398.5956
redmass: 4.3865 4.8772 4.0952 4.9350 3.5133 3.7923 5.1636 4.8905 6.2271 5.2204 3.9793 3.4430 3.4370 3.7655 4.9941 4.9916 5.8311 6.0818 3.8607 1.1190 1.4421 1.1703 1.1792 1.3536 1.2898 2.0674 3.4476 3.0115 2.9206 3.0480 3.0282 3.4677 4.1661 5.7304 3.6368 4.3108 4.2230 4.5190 4.5928 4.9503 4.4482 3.6406 3.7985 2.6421 3.9842 7.7878 6.6061 6.0000 5.5745 4.6134 1.4924 4.2031 3.6068 4.1692 5.8663 7.1098 4.1734 4.2822 2.4274 2.4230 1.5641 1.6508 3.0308 3.3875 1.1419 2.9274 2.8097 2.3188 2.8998 1.5576 1.8952 2.7615 2.8131 1.5460 1.5441 2.6430 2.2955 1.6017 3.1708 2.2257 2.1830 2.3332 4.3183 4.8786 3.3868 2.4227 2.3750 1.8233 1.8459 1.3384 1.3683 1.4484 1.1190 1.1230 1.7418 3.1122 2.9133 1.3607 1.3886 1.2493 1.2350 1.2187 1.2291 1.2078 1.1817 1.1328 1.1041 1.0413 1.1096 1.1057 1.0448 1.0458 1.0448 1.0466 1.0619 1.0448 1.0517 1.0519 1.0655 1.4323 1.5338 9.2115 9.4405 7.8385 8.7501 8.4400 5.5674 1.0398 1.0391 1.0380 1.0361 1.0360 1.0370 1.0819 1.0599 1.0602 1.0846 1.0978 1.0966 1.0979 1.0975 1.0995 1.0976 1.1026 1.1023 1.1012 1.0998 1.0949 1.1056 1.0973 1.1064 1.0813 1.0750
irintensity: 0.0584 0.5074 0.4408 0.7038 0.3680 0.3947 3.7452 4.4695 1.2075 2.5207 5.8451 3.6494 1.9798 2.3757 0.2321 4.1683 3.0008 4.0772 0.9046 0.5794 2.3522 2.2813 1.1464 0.9934 1.7052 0.2765 2.1354 2.3732 0.1291 2.0066 3.1187 3.2869 7.7896 6.6698 2.6340 8.0900 3.7956 24.1298 7.4046 5.7066 10.0293 0.4773 0.9197 19.0756 6.7368 6.0913 1.9804 2.6298 2.4676 2.3410 54.9977 0.8499 0.5816 5.4864 11.5687 11.0272 2.2537 1.9030 13.7709 11.7320 2.2394 5.6027 2.7204 5.0236 72.1102 30.0770 39.3010 3.4071 5.0574 33.2179 8.7752 68.0508 48.5642 1.4603 0.8921 9.1976 33.8984 11.0175 10.3797 115.3078 83.6302 71.0447 385.4713 236.4965 47.8688 499.8761 436.1831 52.5023 134.6477 12.2826 23.8627 29.8867 4.1433 10.6461 50.6803 78.4770 62.9141 17.1426 17.5724 85.9004 22.3948 48.1259 22.5523 30.2941 20.4562 160.0393 73.7856 11.7716 53.5195 30.6196 13.0689 21.3384 17.7899 6.9996 6.1443 13.2988 17.8686 19.3364 32.5281 146.2341 264.7187 131.0299 79.9244 118.1107 177.2659 337.2319 112.2734 12.1259 9.1450 24.3375 25.0596 16.8985 23.1122 18.0603 38.3561 27.9286 8.2375 14.6319 10.6613 32.7416 41.7252 21.1101 32.3493 2.3482 3.0575 10.4306 12.6605 1.2426 29.9556 2.8862 22.4640 460.2839 11.9994
temp: 298.150 k
press: 1.00000 atm
elementType: 16 8 8 8 8 8 8 7 7 7 7 6 6 6 6 6 6 6 6 6 6 6 6 6 6 6 6 1 1 1 1 1 1 1 1 1 1 1 1 1 1 1 1 1 1 1 1 1 1 1 1 1 1
symmnumber: 1
zpe: 1095189.0 jmol-1
zpe.correction: 0.417135 hartree
zpe.thermalcorrener: 0.448572 hartree
zpe.thermalcorrenthalpy: 0.449516 hartree
zpe.thermalcorrgfe: 0.350406 hartree
zpe.sumelectzpe: -1691.571569 hartree
zpe.sumelectthermal: -1691.540132 hartree
zpe.sumelectthermalent: -1691.539188 hartree
zpe.sumelectthermalfe: -1691.638298 hartree
dipole: -8.6427 2.5099 -0.7782
dipole: 9.0334
quadrupole: -171.4802 -153.6519 -166.1165
quadrupole: -23.0093 -2.7550 -9.4276
quadrupole: -7.7307 10.0976 -2.3670 -23.0093 -2.7550 -9.4276
hfenergy: -1691.9887041 hartree
pointgroup: C01 [X(C16H26N4O6S1)]
dipole: -1.3554076 -3.2210113 0.6472301 debye
polarizability: 304.3592324|2.1080281|336.7555165|-28.8620357|-23.0445961|191.1323531 unknown
InChI: InChI=1S/C16H26N4O6S/c1-7-25-15(23)9(3)17-19-13(21)11(5)27-12(6)14(22)20-18-10(4)16(24)26-8-2/h11-12,19-20H,7-8H2,1-6H3
charge 0 multiplicity 1
53 atoms
S  -3.29402 1.170908 0.003592
O  -1.665302 4.278089 1.342408
O  -0.6365 -0.347019 0.222713
O  2.517581 5.10528 -0.753046
O  2.261215 -3.996152 1.161336
O  3.682117 3.414725 -1.862571
O  1.406369 -6.057884 1.847812
N  -0.37666 2.538084 0.40064
N  -1.460654 -2.442832 0.833021
N  0.613555 3.391155 -0.033816
N  -0.196224 -2.990288 0.968536
C  -2.46875 1.964156 1.561691
C  -3.100266 -0.672585 0.374504
C  -3.525983 2.519101 2.520356
C  -3.867054 -1.425848 -0.742655
C  -1.48196 3.06176 1.092639
C  -1.615301 -1.099376 0.453076
C  1.624932 2.857837 -0.701566
C  -0.131756 -4.261968 1.32065
C  1.79749 1.394455 -1.050384
C  -1.308689 -5.178324 1.589222
C  2.698642 3.793975 -1.166947
C  1.238034 -4.865145 1.475071
C  3.538675 6.090157 -1.22132
C  3.656636 -4.522232 1.318559
C  3.178969 6.622152 -2.612025
C  4.139132 -4.342564 2.759975
H  -1.893307 1.141258 2.022874
H  -3.57965 -0.86845 1.353733
H  -4.092636 3.334685 2.04321
H  -3.039201 2.939587 3.419146
H  -4.228695 1.72578 2.828703
H  -3.404851 -1.237416 -1.726929
H  -4.913096 -1.077782 -0.779016
H  -3.879051 -2.518267 -0.571868
H  -0.369846 1.515534 0.206074
H  -2.306197 -3.006537 1.003481
H  0.953346 1.022817 -1.662362
H  1.83642 0.757933 -0.146267
H  2.729481 1.261749 -1.618703
H  -0.933361 -6.171313 1.877479
H  -1.944462 -5.299785 0.689462
H  -1.944742 -4.800514 2.414558
H  4.530671 5.604321 -1.22148
H  3.497717 6.879726 -0.454231
H  4.234234 -3.911544 0.607458
H  3.669593 -5.583881 1.015455
H  3.88598 7.42247 -2.900499
H  2.158575 7.042223 -2.616438
H  3.239792 5.819485 -3.365974
H  5.200853 -4.642478 2.833765
H  3.555837 -4.971236 3.453423
H  4.056672 -3.287687 3.072474
