program: Gaussian 09
title: 000255501
version: EM64L-G09RevD.01
frameworkgroup: C1[X(C20H18N2O6)]
method: RPBEPBE
basis: SDD
operation: Freq
keyword: #p
keyword: freq=noraman
keyword: PBEPBE/SDD
title: #p freq=noraman PBEPBE/SDD
converged: YES YES NO NO
title: Mulliken charges:
elementType: O O O O O O N N C C C C C C C C C C C C C C C C C C C C H H H H H H H H H H H H H H H H H H
charge: -0.215601 -0.217561 -0.271724 -0.146112 -0.217416 -0.214600 0.023385 -0.105368 0.468927 0.198630 0.156759 0.219343 -0.516791 -0.569646 -0.418887 0.101537 0.116398 0.277464 -0.247180 0.082675 -0.247521 -0.366939 -0.321100 -0.682345 -0.680461 -0.222304 -0.229102 -0.226369 0.348086 0.310580 0.327073 0.220792 0.221242 0.221137 0.222175 0.252572 0.275840 0.236416 0.236478 0.207569 0.213706 0.235576 0.235400 0.232614 0.237635 0.237017
chargesum: 0.00000
title: Mulliken charges with hydrogens summed into heavy atoms:
elementType: O O O O O O N N C C C C C C C C C C C C C C C C C C C C
charge: -0.215601 -0.217561 -0.271724 -0.146112 -0.217416 -0.214600 0.023385 -0.105368 0.468927 0.198630 0.156759 0.219343 -0.168704 -0.259066 -0.091814 0.101537 0.116398 0.277464 0.194854 0.082675 0.195792 -0.114368 -0.045260 -0.001882 0.004221 0.010309 0.008533 0.010649
polarizability: 5.88110137e+02 -2.36310615e+01 3.52704410e+02 8.48748804e-01 2.01385270e-01 1.13382968e+02
1716.lowfreq: -0.0011 -0.0011 -0.0007 4.2633 4.8307 8.4331 16.8467 17.8110 31.3106
frequency: 16.8224 17.6444 31.3038 36.9125 43.6610 57.8193 80.0850 87.9518 92.0970 98.6319 111.0466 115.5595 136.0022 144.3779 172.6485 173.8761 200.9353 202.1983 233.5714 239.7089 244.9198 256.9019 270.0025 282.4390 316.7766 318.2466 336.2986 394.0340 400.8649 402.3626 414.9777 450.7125 475.1704 508.0966 524.7285 533.2539 586.6539 610.2388 616.6813 625.7348 639.9198 650.2197 680.5139 695.7337 697.6550 720.8785 727.0790 739.7652 745.6047 757.9413 771.9758 787.9867 824.1854 825.0120 828.5846 848.9833 859.2461 873.8590 913.2927 921.4934 932.2110 946.2937 949.2793 973.6394 988.4659 991.4675 1008.2872 1018.8220 1023.9719 1027.1688 1044.6257 1060.6309 1088.4266 1113.0656 1116.4602 1116.9802 1133.2654 1134.5530 1175.2540 1176.0839 1184.9325 1187.4542 1198.4648 1269.5883 1270.3033 1273.0200 1275.9412 1302.2430 1320.1239 1326.2906 1358.5971 1369.7957 1379.6026 1389.3921 1402.3473 1404.2211 1405.9611 1436.3278 1438.1378 1460.8147 1462.2202 1463.5064 1472.6705 1474.5001 1485.1243 1485.7524 1514.7755 1518.2264 1547.8852 1583.3047 1595.9721 1609.1283 1633.7935 1724.0643 2966.9184 2971.2147 2999.1377 3001.3809 3029.3173 3034.0499 3095.4163 3098.7976 3110.5992 3111.8556 3133.3654 3144.7811 3145.5903 3156.6794 3162.8549 3166.5336 3176.7241 3192.3512
redmass: 12.1636 5.4945 5.7972 5.3133 4.0879 4.4766 6.5018 3.9640 2.9837 4.2608 2.0546 2.4477 2.5798 6.2556 8.2196 9.4980 7.3766 8.1622 4.0236 1.2212 1.3676 3.9183 4.8893 6.0759 7.1832 4.8910 5.2373 7.5620 5.6038 3.2538 5.9596 4.1575 3.5679 8.1947 6.7732 6.2564 6.9511 6.8768 7.5014 6.7754 6.7186 8.0118 6.9555 1.6918 7.5216 7.5226 6.8626 8.4610 9.8182 6.8383 2.8911 2.0216 1.1226 4.2142 1.1168 11.1663 1.2493 3.4690 1.5302 4.6388 6.8713 1.3988 1.3677 1.4864 6.2537 1.3860 1.3358 2.9799 2.5316 2.5136 3.4852 3.3528 1.8073 3.4154 2.2785 2.2514 1.4393 1.4498 1.1095 7.3316 1.4284 2.6689 2.5404 1.1321 1.1353 3.7722 3.9347 1.4399 1.3876 3.8427 2.7863 1.3760 1.5472 8.5798 1.3369 1.4713 2.1730 6.0020 2.7060 1.0392 1.0389 2.5154 1.1189 1.0876 1.0853 1.0791 4.2771 3.4361 7.9562 6.0966 6.1529 6.2079 8.3410 12.9112 1.0556 1.0557 1.0367 1.0366 1.1080 1.1080 1.0986 1.0988 1.1016 1.1017 1.0855 1.0887 1.0928 1.0932 1.0889 1.0970 1.1000 1.0901
irintensity: 0.1138 0.0078 0.2163 0.0192 0.0667 0.1445 0.1232 2.1513 1.7344 0.8438 9.1507 0.0497 0.6953 1.2102 0.7756 2.5567 0.7803 1.4244 0.0913 1.8634 0.0057 0.2142 1.5812 3.9992 3.7176 1.6865 0.1750 3.2304 3.5229 1.1750 3.6681 0.6033 0.2922 7.1467 27.8137 2.0772 4.0169 2.8248 2.5895 14.2024 16.1702 2.8438 13.8516 65.0927 26.1111 3.7107 18.9432 1.2674 19.9271 119.1673 0.1626 38.5966 9.4390 16.7992 6.5402 7.6624 0.4528 34.2052 23.1827 96.4643 25.3383 0.0003 10.7515 27.2710 1.3343 0.0395 0.1727 11.0742 68.7770 71.4197 122.9818 63.0516 0.2620 74.4602 3.5855 5.4868 4.8896 5.2493 31.4483 898.1876 55.1175 70.2718 88.8798 0.2700 0.1929 132.4816 466.8365 27.4807 10.4737 26.5004 49.1232 53.6993 7.1495 4.7444 31.3102 6.4489 71.2532 6.9736 52.1812 9.5623 15.7382 113.7023 45.1123 73.1772 17.2500 37.6895 193.2344 265.8282 102.8392 15.8170 338.2154 61.6465 92.3950 415.0289 24.7951 35.5824 19.4935 27.4006 22.0988 24.9625 20.1391 23.4101 25.2301 33.4796 0.4751 5.6988 35.6869 20.7659 41.7558 15.6959 21.0926 7.7402
temp: 298.150 k
press: 1.00000 atm
elementType: 8 8 8 8 8 8 7 7 6 6 6 6 6 6 6 6 6 6 6 6 6 6 6 6 6 6 6 6 1 1 1 1 1 1 1 1 1 1 1 1 1 1 1 1 1 1
symmnumber: 1
zpe: 905052.0 jmol-1
zpe.correction: 0.344716 hartree
zpe.thermalcorrener: 0.370563 hartree
zpe.thermalcorrenthalpy: 0.371507 hartree
zpe.thermalcorrgfe: 0.285655 hartree
zpe.sumelectzpe: -1331.667864 hartree
zpe.sumelectthermal: -1331.642017 hartree
zpe.sumelectthermalent: -1331.641073 hartree
zpe.sumelectthermalfe: -1331.726925 hartree
dipole: 0.6918 -9.8181 -0.0200
dipole: 9.8425
quadrupole: -126.5899 -185.4239 -163.8000
quadrupole: -0.7437 -0.2141 -0.2554
quadrupole: 32.0147 -26.8193 -5.1954 -0.7437 -0.2141 -0.2554
hfenergy: -1332.0125798 hartree
pointgroup: C01 [X(C20H18N2O6)]
dipole: -0.5503872 -3.7900731 0.5721146 debye
polarizability: 556.1988012|-56.3300779|362.0167038|81.8837227|-52.8566788|135.9820105 unknown
InChI: InChI=1S/C20H18N2O6/c1-3-26-17-11-14(16(22(24)25)12-18(17)27-4-2)10-15-20(23)28-19(21-15)13-8-6-5-7-9-13/h5-12H,3-4H2,1-2H3
charge 0 multiplicity 1
46 atoms
O  -2.513892 -2.192815 -0.079627
O  -4.771065 -0.934402 -0.689147
O  3.686934 1.29276 0.270294
O  2.86021 3.455312 -0.250632
O  -3.685253 3.840588 -1.455503
O  -1.513637 4.20266 -0.906631
N  -2.524642 3.409914 -1.067624
N  1.714801 0.07547 0.192432
C  -1.141141 1.308896 -0.472813
C  -2.382803 1.958626 -0.796473
C  -2.40605 -0.830946 -0.307084
C  -3.631656 -0.151667 -0.63729
C  -1.210043 -0.10133 -0.237097
C  -3.593493 1.231644 -0.878119
C  0.147151 1.982147 -0.393505
C  1.380708 1.422704 -0.103952
C  3.028901 0.043782 0.397504
C  3.848224 -1.115128 0.730865
C  -1.274982 -2.935883 0.268145
C  2.616621 2.258853 -0.068454
C  -6.056707 -0.271025 -1.031601
C  3.237803 -2.393466 0.868158
C  5.251597 -0.976946 0.918499
C  -1.683555 -4.390782 0.469307
C  -7.126624 -1.356454 -1.010268
C  4.023232 -3.516311 1.188297
C  6.030495 -2.106794 1.239099
C  5.421251 -3.376915 1.374661
H  -0.266827 -0.597202 0.003961
H  -4.493091 1.793155 -1.135819
H  0.157108 3.059705 -0.580343
H  -0.545111 -2.823792 -0.558626
H  -0.840644 -2.498845 1.189621
H  -6.262438 0.521326 -0.284479
H  -5.964289 0.19454 -2.033048
H  2.156584 -2.481177 0.720481
H  5.71013 0.010516 0.810447
H  -2.420237 -4.480873 1.285183
H  -2.131507 -4.80175 -0.450986
H  -0.797047 -4.997661 0.728878
H  -8.109245 -0.917836 -1.261288
H  -6.897502 -2.146203 -1.745288
H  -7.194458 -1.819206 -0.011413
H  3.553531 -4.500088 1.293716
H  7.110637 -1.999361 1.38319
H  6.030227 -4.252842 1.623775
