program: Gaussian 09
title: 000255500
version: EM64L-G09RevD.01
frameworkgroup: C1[X(C16H9Cl2NO2)]
method: RPBEPBE
basis: SDD
operation: Freq
keyword: #p
keyword: freq=noraman
keyword: PBEPBE/SDD
title: #p freq=noraman PBEPBE/SDD
converged: YES YES NO NO
title: Mulliken charges:
elementType: Cl Cl O O N C C C C C C C C C C C C C C C C H H H H H H H H H
charge: -0.002650 0.014864 -0.267674 -0.199318 -0.096342 0.059262 0.521588 0.299917 0.098924 -0.343417 0.134036 -0.368361 -0.384465 -0.364780 -0.334396 -0.097533 -0.228696 -0.219721 -0.223879 -0.117283 -0.225516 0.254263 0.261769 0.314201 0.271143 0.272250 0.264898 0.235380 0.235623 0.235913
chargesum: 0.00000
title: Mulliken charges with hydrogens summed into heavy atoms:
elementType: Cl Cl O O N C C C C C C C C C C C C C C C C
charge: -0.002650 0.014864 -0.267674 -0.199318 -0.096342 0.059262 0.521588 0.299917 0.098924 -0.089154 0.134036 -0.106592 -0.070264 -0.093637 -0.062145 -0.097533 0.036202 0.015659 0.011744 -0.117283 0.010397
polarizability: 5.69789340e+02 -1.19741711e+00 2.01374811e+02 3.81840105e-02 -4.83357886e-02 7.48550614e+01
1716.lowfreq: -0.7212 0.0017 0.0020 0.0029 1.4128 10.4661 25.3942 35.4129 54.1097
frequency: 25.3718 35.4070 54.1078 62.0848 78.3822 119.6900 125.2319 165.6019 168.3323 198.7848 205.4792 207.0514 256.7319 319.2630 341.3786 370.5756 383.1439 399.3048 403.4355 432.4846 441.0999 489.3364 498.4654 552.5936 583.5777 612.0406 649.5430 655.5896 673.3816 681.0197 696.8590 713.1022 732.8457 751.7381 756.8523 786.6945 810.1291 848.5044 861.7521 871.2963 877.5488 949.3837 953.0007 959.6753 987.9879 994.3685 1001.0152 1003.0881 1008.5486 1018.3512 1041.2612 1085.1855 1122.9558 1129.2239 1174.3969 1175.6680 1187.3180 1229.8010 1267.6326 1288.5671 1321.8632 1342.5130 1386.3382 1388.2815 1405.3739 1438.9412 1462.4857 1469.3401 1532.0922 1544.3961 1583.0234 1588.3603 1609.3598 1641.7084 1687.1072 3112.0657 3133.6971 3145.3332 3152.2866 3157.2896 3157.9696 3167.6127 3173.8523 3175.9827
redmass: 8.1058 6.2090 7.3042 6.2987 7.6768 7.5935 6.6415 15.9610 7.0974 14.4811 10.1965 6.7927 7.5276 8.9717 8.3640 5.1056 8.5685 3.8914 2.9746 8.7597 3.1288 4.1768 9.3329 8.1745 4.9454 6.5174 9.0009 7.5279 6.2973 7.4910 1.7424 3.3229 8.5133 8.4910 9.9154 1.9249 12.2079 1.3132 1.2464 6.3240 1.4651 1.4160 6.9436 1.5176 6.2218 1.3842 5.3480 1.3339 1.3326 3.3910 2.8403 1.7166 2.9319 3.2194 1.5604 1.0596 1.1174 1.8862 2.2731 2.9943 1.3545 2.4725 2.9912 8.7078 2.5565 2.3299 2.6388 2.4575 7.2683 6.6944 6.0927 6.3192 6.0936 8.7271 11.5193 1.0874 1.0856 1.0889 1.0924 1.0934 1.0909 1.0967 1.0972 1.1005
irintensity: 0.0750 0.5046 0.5817 1.6684 0.1683 0.6724 0.1448 0.0710 0.0281 0.2986 3.1685 0.8871 2.2060 6.6504 2.2611 0.6895 10.0009 0.2028 0.0479 9.3814 10.8770 0.3782 16.4221 13.3742 4.9832 0.4108 1.4686 9.1343 24.0654 9.7601 61.5229 8.5202 11.5319 5.9267 19.7963 44.0620 255.3559 26.6229 0.0031 44.3651 9.8527 5.0611 63.6763 31.0344 2.6082 0.0081 41.1665 3.6078 0.2917 14.5666 64.6606 8.2208 16.0327 170.9946 3.5760 0.1192 20.1255 83.0921 21.4522 60.5991 6.4894 6.6466 9.6699 1.8398 24.7556 36.4140 133.3116 46.7585 30.7244 63.7810 17.9779 67.0871 8.9577 318.4540 161.1728 6.9815 0.3284 9.5364 0.7079 19.5010 10.4251 14.0739 13.1115 26.8879
temp: 298.150 k
press: 1.00000 atm
elementType: 17 17 8 8 7 6 6 6 6 6 6 6 6 6 6 6 6 6 6 6 6 1 1 1 1 1 1 1 1 1
symmnumber: 1
zpe: 539818.0 jmol-1
zpe.correction: 0.205606 hartree
zpe.thermalcorrener: 0.222982 hartree
zpe.thermalcorrenthalpy: 0.223926 hartree
zpe.thermalcorrgfe: 0.158053 hartree
zpe.sumelectzpe: -1738.979739 hartree
zpe.sumelectthermal: -1738.962363 hartree
zpe.sumelectthermalent: -1738.961419 hartree
zpe.sumelectthermalfe: -1739.027292 hartree
dipole: 3.3050 1.6925 -0.0139
dipole: 3.7132
quadrupole: -116.6640 -132.1306 -138.1656
quadrupole: 7.1982 0.0050 0.0345
quadrupole: 12.3227 -3.1439 -9.1789 7.1982 0.0050 0.0345
hfenergy: -1739.1853449 hartree
pointgroup: C01 [X(C16H9Cl2N1O2)]
dipole: -1.3523258 0.326294 -0.4460502 debye
polarizability: 566.185338|34.9192783|131.4712459|-13.3618897|-63.8751715|148.3626292 unknown
InChI: InChI=1S/C16H9Cl2NO2/c17-12-7-6-10(8-13(12)18)9-14-16(20)21-15(19-14)11-4-2-1-3-5-11/h1-9H
charge 0 multiplicity 1
30 atoms
Cl 5.859864 2.064174 -1.852853
Cl 7.039392 0.100952 0.511081
O  -1.79412 -0.976976 1.261959
O  0.389647 -1.474462 1.960245
N  -1.386399 0.529118 -0.452487
C  -0.123617 0.133721 0.074118
C  2.452214 0.470318 -0.1710
C  -3.760439 -0.054677 0.088943
C  -2.31289 -0.116086 0.239523
C  1.038701 0.658088 -0.467829
C  -0.348559 -0.840833 1.186671
C  3.371306 1.207439 -0.982716
C  2.984979 -0.378583 0.850173
C  -4.320055 0.785808 -0.914439
C  -4.612721 -0.821834 0.930649
C  4.75615 1.10377 -0.787158
C  4.373801 -0.47531 1.03949
C  -5.717003 0.854777 -1.070167
C  -6.010548 -0.745372 0.76667
C  5.265389 0.260703 0.227002
C  -6.565958 0.090546 -0.231194
H  0.828064 1.357556 -1.289359
H  2.996031 1.866054 -1.772978
H  2.312174 -0.95697 1.488182
H  -3.646715 1.368034 -1.551507
H  -4.171381 -1.464773 1.698126
H  4.78009 -1.124511 1.820505
H  -6.148009 1.501452 -1.841766
H  -6.667257 -1.335739 1.414313
H  -7.653031 0.147012 -0.355294
