program: Gaussian 09
title: 000018199
version: EM64L-G09RevD.01
frameworkgroup: C1[X(CH4O2)]
method: RPBEPBE
basis: SDD
operation: Freq
keyword: #p
keyword: freq=noraman
keyword: PBEPBE/SDD
title: #p freq=noraman PBEPBE/SDD
converged: NO YES NO NO
title: Mulliken charges:
elementType: O O C H H H H
charge: -0.209105 -0.369548 -0.466826 0.228255 0.225026 0.227877 0.364321
chargesum: 0.00000
title: Mulliken charges with hydrogens summed into heavy atoms:
elementType: O O C
charge: -0.209105 -0.005227 0.214333
polarizability: 3.02512001e+01 -1.21312550e+00 1.94510786e+01 8.08077492e-02 5.60217697e-02 1.35771523e+01
1716.lowfreq: -14.7615 -0.0006 -0.0005 0.0001 7.2307 25.7127 78.0039 231.0963 386.6927
frequency: 77.9092 231.0860 386.6925 798.3469 966.2506 1110.7464 1117.2353 1305.3584 1407.3891 1422.9264 1487.2205 2965.7107 3063.8002 3094.3669 3513.4980
redmass: 1.1039 1.1994 3.1719 6.4434 6.8092 1.3241 1.2565 1.2788 1.1312 1.0538 1.0541 1.0281 1.1056 1.1017 1.0678
irintensity: 187.0333 7.3194 21.1062 9.2977 18.9537 4.5829 0.4954 51.1901 2.7073 12.4778 11.8016 37.6843 56.6870 19.6117 11.0542
temp: 298.150 k
press: 1.00000 atm
elementType: 8 8 6 1 1 1 1
symmnumber: 1
zpe: 137262.7 jmol-1
zpe.correction: 0.052281 hartree
zpe.thermalcorrener: 0.056925 hartree
zpe.thermalcorrenthalpy: 0.057869 hartree
zpe.thermalcorrgfe: 0.026053 hartree
zpe.sumelectzpe: -190.583262 hartree
zpe.sumelectthermal: -190.578617 hartree
zpe.sumelectthermalent: -190.577673 hartree
zpe.sumelectthermalfe: -190.609490 hartree
dipole: -0.4591 0.1061 0.0504
dipole: 0.4739
quadrupole: -11.8929 -19.5777 -19.0034
quadrupole: 2.2665 0.1013 0.0188
quadrupole: 4.9318 -2.7530 -2.1787 2.2665 0.1013 0.0188
hfenergy: -190.6355427 hartree
pointgroup: C01 [X(C1H4O2)]
dipole: 0.1810194 0.0440695 0.0069034 debye
dipolederiv: -0.1330618 0.1717809 0.0139809 0.1301673 -0.295534 0.022802 0.0182138 0.0315008 -0.3051045 -0.4539439 -0.140604 0.0104637 -0.1499933 -0.1187442 -0.0630102 0.0087139 -0.0624785 -0.3919714 0.3220726 -0.112218 0.0035432 -0.1918067 0.3095351 -0.0272255 0.0116803 -0.0141598 0.3590532 0.0554545 0.0032904 0.0331642 0.0865113 0.0147882 0.1250693 -0.0121569 0.1166188 -0.1266449 -0.0329169 -0.0804129 -0.0220436 -0.0735341 -0.0042981 -0.0000632 -0.0224042 -0.0011811 0.1327857 0.0453515 0.0454629 0.0164549 0.1334413 -0.0308907 -0.1053879 0.0458193 -0.1265593 -0.0735741 0.197044 0.1127008 -0.0555633 0.0652141 0.1251436 0.0478154 -0.0498662 0.0562592 0.4054559 unknown
polarizability: 29.7197269|1.5656581|19.4517264|2.7339197|-0.3628007|14.1079777 unknown
InChI: InChI=1S/CH4O2/c1-3-2/h2H,1H3
charge 0 multiplicity 1
7 atoms
O  0.067238 0.503343 -0.267243
O  -1.091637 -0.513681 -0.367638
C  1.226814 -0.335323 0.013661
H  1.104701 -0.880099 0.968547
H  2.060273 0.3857 0.092693
H  1.415532 -1.04751 -0.811163
H  -1.825422 0.127572 -0.582257
