program: Gaussian 09
title: 000255497
version: EM64L-G09RevD.01
frameworkgroup: C1[X(C12H10N2O7)]
method: RPBEPBE
basis: SDD
operation: Freq
keyword: #p
keyword: freq=noraman
keyword: PBEPBE/SDD
title: #p freq=noraman PBEPBE/SDD
converged: YES YES NO NO
title: Mulliken charges:
elementType: O O O O O O O N N C C C C C C C C C C C C H H H H H H H H H H
charge: -0.246218 -0.250942 -0.210638 -0.224905 -0.414841 -0.185455 -0.228098 0.023112 -0.453210 0.165254 0.404146 0.229727 0.220613 -0.459343 -0.520201 -0.204375 -0.461194 0.446016 0.056557 0.263754 -0.782096 0.293166 0.309409 0.248586 0.250723 0.278430 0.316195 0.266810 0.260188 0.220686 0.388146
chargesum: 0.00000
title: Mulliken charges with hydrogens summed into heavy atoms:
elementType: O O O O O O O N N C C C C C C C C C C C C
charge: -0.246218 -0.250942 -0.210638 -0.224905 -0.026695 -0.185455 -0.228098 0.023112 -0.137016 0.165254 0.404146 0.229727 0.220613 -0.166177 -0.210792 0.294934 -0.182764 0.446016 0.056557 0.263754 -0.034412
polarizability: 3.09054866e+02 2.10514488e-02 2.08654826e+02 1.06032475e+01 1.58146620e+00 1.00969577e+02
1716.lowfreq: -5.5965 -0.9193 -0.0007 -0.0007 -0.0003 7.9908 20.7812 30.3120 33.2751
frequency: 20.4441 30.3069 33.2078 39.8144 47.5926 61.0882 87.3917 103.5931 124.1557 137.3329 152.2488 165.2906 189.4850 240.2107 247.5571 269.5693 289.8284 331.8642 341.5668 379.8389 392.2069 423.3490 437.1805 494.7039 523.1720 557.8271 572.5964 581.1367 598.8127 612.3528 638.4355 663.7843 665.9255 683.3003 695.9644 716.4958 741.1364 750.2609 755.6683 785.1786 831.4744 837.4171 847.7849 893.4728 911.2548 943.5952 970.9940 988.6357 1004.1540 1029.4865 1039.3354 1067.4198 1096.3865 1125.4225 1150.9868 1191.7791 1204.9051 1240.3726 1244.2230 1265.8001 1271.7734 1336.7240 1358.0220 1366.1228 1383.0269 1390.1206 1434.2030 1447.1872 1467.6644 1469.7625 1482.8875 1487.9864 1604.7352 1609.4353 1623.7798 1630.6993 1657.5396 2996.3869 3023.2311 3086.8323 3120.5080 3121.9343 3151.3207 3180.7372 3206.3876 3522.5513 3531.3646
redmass: 3.9029 5.6062 1.7363 3.6500 6.7887 4.3269 2.8821 5.6100 7.4213 6.1453 6.3032 8.9432 8.0482 6.8180 7.1886 5.4957 6.3848 6.1414 10.9812 5.0397 7.9721 3.6331 3.8403 6.1171 1.9002 3.5745 4.7107 3.8135 2.1775 3.1241 1.8745 5.5737 6.2062 9.8653 7.5943 5.7599 6.9368 5.7548 8.9554 6.1605 4.9067 2.3290 3.3585 1.3887 1.3837 5.8208 6.3358 1.7152 3.8104 2.8787 1.6539 1.4709 3.6966 1.0682 2.0356 11.2630 3.1013 1.7018 1.6405 1.8273 3.3939 6.9876 2.3724 1.9586 2.9496 1.2329 3.3437 1.1933 1.9610 1.0880 1.6193 1.9490 10.0003 9.1113 8.0216 6.0718 9.6101 1.0374 1.0574 1.0985 1.0990 1.1149 1.0885 1.0935 1.0929 1.0641 1.0774
irintensity: 4.7846 1.7956 1.5723 0.0312 2.1633 1.8221 7.5245 7.3173 2.0531 0.5603 13.9753 2.7753 0.7908 4.6211 2.8236 3.8736 1.4656 1.1582 0.0540 1.7228 6.3811 9.1160 1.8497 24.2364 76.7992 5.8532 5.2865 3.3340 11.9123 17.6569 72.1764 23.4528 20.9204 0.2112 2.6678 5.0950 11.6162 24.6159 4.0251 31.4912 18.0200 21.7791 21.4541 6.1081 57.8665 0.5367 170.1044 27.7719 137.7330 148.6454 27.0298 8.3545 5.4237 1.1327 85.9135 481.3463 76.9690 19.1675 155.9018 63.3156 111.5884 345.7891 216.0243 60.8418 164.8716 38.9257 91.1226 34.9298 365.1791 12.4963 100.9893 70.8161 70.2396 163.9004 72.2305 55.3916 190.5729 8.2188 106.3969 12.7434 7.8997 21.5781 28.2488 0.7929 11.4384 41.7494 18.3501
temp: 298.150 k
press: 1.00000 atm
elementType: 8 8 8 8 8 8 8 7 7 6 6 6 6 6 6 6 6 6 6 6 6 1 1 1 1 1 1 1 1 1 1
symmnumber: 1
zpe: 558833.7 jmol-1
zpe.correction: 0.212849 hartree
zpe.thermalcorrener: 0.232550 hartree
zpe.thermalcorrenthalpy: 0.233494 hartree
zpe.thermalcorrgfe: 0.161299 hartree
zpe.sumelectzpe: -1097.718525 hartree
zpe.sumelectthermal: -1097.698824 hartree
zpe.sumelectthermalent: -1097.697879 hartree
zpe.sumelectthermalfe: -1097.770075 hartree
dipole: -0.2729 -3.8725 -4.6565
dipole: 6.0625
quadrupole: -95.2463 -127.2398 -124.7514
quadrupole: -21.6787 12.7002 -4.6220
quadrupole: 20.4995 -11.4939 -9.0056 -21.6787 12.7002 -4.6220
hfenergy: -1097.9313732 hartree
pointgroup: C01 [X(C12H10N2O7)]
dipole: -0.1597956 1.8874069 -1.4495308 debye
polarizability: 306.2820687|16.2689182|206.5634759|-15.3407248|19.9809808|105.8337239 unknown
InChI: InChI=1S/C12H10N2O7/c1-6(15)13-8(12(16)17)2-7-3-10-11(21-5-20-10)4-9(7)14(18)19/h2-4,13,16H,5H2,1H3
charge 0 multiplicity 1
31 atoms
O  -3.233144 2.156976 0.0272
O  -4.645952 0.227828 0.232006
O  -1.73459 -3.905648 -0.184977
O  0.303382 -3.176617 -0.87641
O  1.882289 2.633163 0.326035
O  1.196531 1.099249 1.947267
O  4.275131 1.21847 1.033743
N  -0.912704 -2.950124 -0.482949
N  3.207175 0.233228 -0.782363
C  -2.474657 0.980864 -0.101979
C  -0.526476 -0.423832 -0.491195
C  -3.305657 -0.159652 0.018602
C  -1.399968 -1.560145 -0.378254
C  -1.114128 0.877897 -0.365353
C  -2.798532 -1.441095 -0.120741
C  -4.606617 1.704504 0.401993
C  0.91506 -0.521932 -0.766677
C  1.888425 0.316541 -0.279352
C  1.648341 1.336319 0.811074
C  4.351011 0.696282 -0.113838
C  5.654155 0.550435 -0.883987
H  -0.506439 1.773706 -0.5100
H  -3.410507 -2.339585 -0.033556
H  -4.783618 1.953735 1.463212
H  -5.332755 2.165959 -0.283964
H  1.228018 -1.33379 -1.429471
H  3.334656 -0.266539 -1.665469
H  6.45884 0.290195 -0.178705
H  5.916414 1.519889 -1.345724
H  5.609147 -0.21272 -1.680159
H  1.838669 3.276038 1.08459
