program: Gaussian 09
title: 000255495
version: EM64L-G09RevD.01
frameworkgroup: C1[X(C16H20O4)]
method: RPBEPBE
basis: SDD
operation: Freq
keyword: #pfreq=noraman
keyword: PBEPBE/SDD
title: #p freq=noraman PBEPBE/SDD
converged: YES YES NO NO
title: Mulliken charges:
elementType: O O O O C C C C C C C C C C C C C C C C H H H H H H H H H H H H H H H H H H H H
charge: -0.235377 -0.230977 -0.240216 -0.227445 -0.024780 -0.557646 0.183275 -0.701627 0.111782 -0.426664 0.526481 -0.556502 -0.388872 0.195951 0.196355 -0.364213 -0.242705 -0.245857 -0.683428 -0.681919 0.232053 0.244240 0.234012 0.228704 0.244576 0.210535 0.258296 0.257057 0.243695 0.248174 0.210274 0.210867 0.210461 0.209874 0.207526 0.233646 0.233382 0.206427 0.235112 0.235470
chargesum: 0.00000
title: Mulliken charges with hydrogens summed into heavy atoms:
elementType: O O O O C C C C C C C C C C C C C C C C
charge: -0.235377 -0.230977 -0.240216 -0.227445 0.207273 -0.079394 0.183275 -0.017812 0.111782 -0.168368 0.526481 -0.299444 -0.145177 0.195951 0.196355 -0.116038 0.178435 0.174479 -0.008874 -0.004909
polarizability: 3.47627642e+02 9.04394935e+00 2.12253217e+02 8.33041336e-01 -2.51275667e+00 1.07114511e+02
1716.lowfreq: -5.5360 -5.0942 -0.0005 -0.0003 0.0001 4.3307 16.2635 37.2379 58.6923
frequency: 16.1209 37.2331 58.6917 61.6447 79.7154 88.9626 93.1030 109.3152 121.1096 128.4960 148.1364 173.5557 200.3037 229.1018 234.0709 238.5869 240.9196 257.9484 301.5472 313.9903 317.1180 350.3933 374.6022 431.7959 450.1221 464.7507 498.1680 538.9659 579.4136 604.7639 613.3565 626.8952 628.6278 688.5977 744.3324 745.7062 754.6050 782.0058 798.1042 825.4228 831.3911 843.7427 866.7676 868.9678 899.0010 913.4920 916.4091 928.5996 958.1458 962.9715 1004.9801 1030.7108 1032.8570 1043.1796 1087.2612 1113.6180 1116.7260 1127.9977 1133.8294 1134.1468 1138.7813 1160.7759 1187.1966 1198.1567 1236.7294 1253.7974 1262.4417 1262.7764 1274.8609 1297.2790 1304.5340 1344.5178 1353.4018 1365.3504 1369.4515 1393.1491 1397.7007 1399.9755 1407.8836 1424.9556 1458.5818 1459.1886 1459.4950 1461.0425 1475.3219 1476.0733 1478.4703 1486.6242 1487.3849 1513.2983 1572.5890 1600.5173 1648.0831 1674.6623 2954.2919 2956.5801 2970.1184 2989.1689 2998.4363 2999.1298 3005.4157 3013.4840 3016.3947 3043.7678 3081.4120 3086.0927 3095.9855 3096.4833 3102.9373 3108.4177 3109.5433 3152.8278 3157.7281 3188.9581
redmass: 4.0395 4.5320 4.2721 3.1596 4.1887 3.1903 3.3165 1.6988 1.8780 4.2761 4.0216 5.0238 7.4278 1.9392 1.3286 1.3587 1.3412 3.5232 3.0986 4.2640 4.0690 5.4583 3.5431 2.8315 2.8320 3.0672 5.2394 5.8471 5.5685 4.9822 4.6651 5.4055 3.6916 6.1573 5.3705 2.7952 4.3561 4.0912 1.5708 1.1356 1.1280 3.8155 1.5607 3.5355 3.5193 1.6576 1.6430 1.5710 2.3945 2.1149 3.5314 2.6878 2.6139 1.8870 1.7575 2.3620 2.2156 2.2776 1.4380 1.4338 2.2918 3.3225 1.5581 1.4370 2.0274 1.8439 1.1428 1.1427 1.9822 1.5451 1.5173 1.5480 2.4139 1.3077 1.3385 1.2465 1.3130 1.2875 2.2606 4.4541 1.0784 1.0399 1.0398 1.0544 1.1139 1.0598 1.0492 1.1040 1.0829 2.5290 6.9553 6.0543 9.9914 10.7680 1.0553 1.0553 1.0643 1.0363 1.0362 1.0363 1.0869 1.1076 1.1076 1.0980 1.0878 1.0987 1.0990 1.0989 1.1006 1.1014 1.1014 1.0905 1.0879 1.0938
irintensity: 1.6771 0.3902 1.2640 3.0398 6.5289 1.2999 0.6914 2.6397 0.2375 0.7860 1.6993 0.0686 1.0450 0.3082 0.7991 0.4495 0.0440 0.0617 0.6306 4.2640 3.5052 1.1474 2.5089 1.4688 2.2161 2.8430 13.9990 9.8461 7.9641 17.1296 14.8738 9.7087 9.2736 6.4069 23.5590 1.9077 1.7017 8.2011 34.1144 13.7644 0.0310 7.8005 14.0364 47.6845 42.3742 10.9773 4.6357 13.8830 24.1390 32.1575 228.0334 101.0697 44.5939 38.2475 16.7583 10.5686 3.3487 198.1487 3.8384 6.0092 81.1665 489.1669 51.5611 10.8193 145.5573 184.7997 0.0547 0.0124 117.9799 59.2931 4.4517 33.3150 49.9021 13.0232 4.8257 27.2884 34.7183 16.6907 27.8807 26.6920 3.9911 0.0731 24.2559 15.8009 51.4100 25.8803 9.4526 43.2098 14.0777 184.5167 46.6675 231.1019 348.4591 142.5954 38.0012 31.4288 11.1806 23.1552 24.0786 30.3716 25.9575 31.1975 37.0190 19.2406 2.4931 27.6351 38.3131 14.1754 32.9063 28.3083 35.7290 10.3168 13.6324 7.0818
temp: 298.150 k
press: 1.00000 atm
elementType: 8 8 8 8 6 6 6 6 6 6 6 6 6 6 6 6 6 6 6 6 1 1 1 1 1 1 1 1 1 1 1 1 1 1 1 1 1 1 1 1
symmnumber: 1
zpe: 856390.5 jmol-1
zpe.correction: 0.326182 hartree
zpe.thermalcorrener: 0.346761 hartree
zpe.thermalcorrenthalpy: 0.347705 hartree
zpe.thermalcorrgfe: 0.275284 hartree
zpe.sumelectzpe: -921.075926 hartree
zpe.sumelectthermal: -921.055347 hartree
zpe.sumelectthermalent: -921.054402 hartree
zpe.sumelectthermalfe: -921.126823 hartree
dipole: -4.4795 -5.2505 0.7619
dipole: 6.9436
quadrupole: -132.0270 -104.5530 -119.9217
quadrupole: -21.8806 3.8699 1.0653
quadrupole: -13.1931 14.2809 -1.0878 -21.8806 3.8699 1.0653
hfenergy: -921.4021076 hartree
pointgroup: C01 [X(C16H20O4)]
dipole: -1.84646 1.5287401 1.3101431 debye
polarizability: 347.5664278|-10.9317851|149.609936|6.0340624|51.0472752|169.8190064 unknown
InChI: InChI=1S/C16H20O4/c1-4-18-14-7-6-12(10-15(14)19-5-2)9-13-8-11(3)20-16(13)17/h6-7,9-11H,4-5,8H2,1-3H3
charge 0 multiplicity 1
40 atoms
O  5.075328 -0.76558 0.138483
O  4.06404 -2.328662 -1.26467
O  -3.405114 -1.32067 -1.183978
O  -3.910251 0.260187 0.878219
C  4.640472 0.406055 0.972249
C  3.103297 0.239816 1.166116
C  2.707664 -0.778415 0.11735
C  5.465278 0.416357 2.257127
C  3.94376 -1.399557 -0.440559
C  1.482217 -1.177452 -0.350963
C  0.135976 -0.756329 0.0374
C  -0.958193 -1.240222 -0.748021
C  -0.16113 0.086048 1.142991
C  -2.290009 -0.893078 -0.4607
C  -2.567447 -0.035875 0.657656
C  -1.492504 0.435805 1.446592
C  -3.170071 -2.213861 -2.338278
C  -4.245046 1.132804 2.0250
C  -4.538826 -2.52363 -2.936864
C  -5.762296 1.292424 2.022012
H  4.857723 1.30216 0.360274
H  2.579712 1.205174 1.045182
H  2.886445 -0.131853 2.188017
H  5.283385 -0.502315 2.84212
H  6.542965 0.475473 2.02928
H  5.191017 1.289934 2.877546
H  1.531924 -1.934583 -1.149505
H  -0.735591 -1.895433 -1.596135
H  0.636732 0.456425 1.789359
H  -1.689969 1.078709 2.309046
H  -2.513871 -1.701997 -3.072273
H  -2.661664 -3.137152 -1.991354
H  -3.888893 0.658087 2.962296
H  -3.734322 2.11018 1.903946
H  -4.427503 -3.192957 -3.809219
H  -5.184965 -3.019705 -2.193072
H  -5.037888 -1.596586 -3.266025
H  -6.077247 1.937274 2.862555
H  -6.102511 1.752495 1.079016
H  -6.25633 0.311808 2.126588
