program: Gaussian 09
title: 000255520
version: EM64L-G09RevD.01
frameworkgroup: C1[X(C26H17NO2S2)]
method: RPBEPBE
basis: SDD
operation: Freq
keyword: #p
keyword: freq=noraman
keyword: PBEPBE/SDD
title: #p freq=noraman PBEPBE/SDD
converged: YES YES NO NO
title: Mulliken charges:
elementType: S S O O N C C C C C C C C C C C C C C C C C C C C C C C C C C H H H H H H H H H H H H H H H H H
charge: 0.732648 0.255146 -0.531392 -0.336165 -0.045821 0.217496 0.194897 -0.493199 -0.348871 0.220502 0.429790 0.457063 -0.390006 0.301418 -0.285068 -0.124648 -0.354061 -0.464421 -0.394402 -0.325706 -0.431160 -0.413681 -0.239663 -0.209015 -0.241270 -0.241876 -0.252575 -0.234178 -0.208666 -0.205601 -0.220326 0.265655 0.241633 0.237700 0.239085 0.276953 0.265501 0.238254 0.239200 0.226692 0.255928 0.295071 0.226848 0.233034 0.232226 0.236067 0.238288 0.234678
chargesum: 0.00000
title: Mulliken charges with hydrogens summed into heavy atoms:
elementType: S S O O N C C C C C C C C C C C C C C C C C C C C C C C C C C
charge: 0.732648 0.255146 -0.531392 -0.336165 -0.045821 0.217496 0.194897 -0.493199 -0.348871 0.220502 0.429790 0.457063 -0.124351 0.301418 -0.043434 -0.124648 -0.116361 -0.225337 -0.117449 -0.060205 -0.192905 -0.174482 -0.012971 0.046913 0.053801 -0.015027 -0.019541 -0.001952 0.027400 0.032687 0.014351
polarizability: 5.79301592e+02 -6.40533514e+01 3.17749803e+02 1.07115721e+01 -1.39556053e+01 3.00245544e+02
1716.lowfreq: -12.4747 -7.5137 -5.7782 -0.0020 -0.0016 0.0004 0.9036 17.5772 25.5673
frequency: -11.6521 17.1093 25.5227 33.1261 36.6306 52.1569 78.2252 89.2150 104.5873 114.9723 137.1890 164.6108 170.8540 192.2507 200.2081 222.4448 226.8804 257.4499 277.0860 295.8551 317.3661 318.1554 335.9854 357.7996 377.8312 395.7503 400.3238 420.4427 428.7876 430.6675 449.7552 459.8754 486.5976 493.6388 512.6361 519.2971 521.1518 533.0808 558.6127 574.2881 604.7542 610.0486 632.1618 639.2270 660.2917 668.5223 689.7420 692.0911 718.5202 746.0138 751.1823 756.8803 760.8167 763.7100 789.9190 804.2177 824.2744 826.6865 836.1115 851.1816 857.5227 867.8041 875.4271 888.4677 894.4247 920.1767 933.3990 957.4310 958.8817 959.1182 977.9620 980.9945 981.2852 985.0956 991.7225 1000.4390 1005.0511 1010.6973 1025.2538 1039.6426 1045.5004 1065.2685 1076.8853 1104.0679 1134.8045 1138.6142 1148.0465 1171.5722 1171.6403 1176.0370 1178.2921 1203.3343 1213.5515 1228.2686 1235.5631 1261.4720 1268.0803 1291.0009 1301.7195 1336.3226 1384.0934 1385.8449 1386.7009 1402.8339 1413.0779 1425.3813 1431.6158 1436.6828 1442.8319 1453.7684 1468.0757 1494.2537 1514.9153 1549.7342 1559.3185 1581.6834 1589.5121 1596.9520 1606.6929 1610.4594 1624.3269 3122.0090 3124.1070 3128.5389 3128.7835 3131.7373 3134.7102 3138.8145 3138.9313 3147.3204 3151.0629 3152.4637 3155.4582 3158.7777 3163.6008 3168.0003 3170.7546 3171.9965
redmass: 8.1080 5.0768 5.8797 5.4537 5.2969 4.5388 6.6027 7.9832 6.4040 6.3031 5.4543 6.1709 4.9041 5.5267 6.9755 5.1983 6.0947 7.4333 9.5577 5.8404 8.0036 7.0930 7.4490 7.5875 9.2343 3.7717 2.8442 7.0840 4.6763 4.1070 5.3654 6.0261 4.9973 5.4165 3.8552 5.3004 6.3009 4.3720 4.4572 3.5724 6.4763 7.8651 6.7826 6.3574 6.9398 4.0039 2.5266 4.0431 6.2385 5.0057 5.0555 1.5646 1.2639 1.3171 4.6062 3.0236 1.6361 1.4460 4.6376 1.2507 6.2327 14.5073 5.1263 1.5918 1.6721 7.1797 1.3616 2.4904 2.0328 1.4347 1.4181 4.3847 1.4517 1.3901 1.3451 1.3358 1.3346 3.9167 2.3100 2.2781 2.1527 3.3537 1.5626 2.0157 1.4167 2.4820 1.3372 1.0740 1.0897 1.0683 1.1211 1.9616 2.6797 1.9006 1.9513 1.9737 1.8074 1.8696 1.3123 3.2277 5.1966 9.0491 9.4522 2.0775 2.7735 4.2455 2.1809 2.4631 2.7229 2.0233 3.4516 3.5294 4.8311 6.9279 6.9060 5.8463 6.4811 6.6315 6.3637 6.9213 6.6127 1.0860 1.0872 1.0869 1.0878 1.0854 1.0902 1.0883 1.0888 1.0920 1.0943 1.0976 1.0963 1.0967 1.0967 1.1004 1.1016 1.0970
irintensity: 0.5572 0.5132 0.2263 0.3510 0.1003 0.3081 0.4747 0.6040 0.6947 1.1281 0.3952 1.0825 0.9624 0.4852 14.8956 4.9442 1.2442 2.7007 2.0641 0.1821 4.2127 9.1524 1.4105 12.0986 6.5663 0.8452 0.6830 32.2016 5.4582 2.9457 3.3807 2.1810 8.8167 14.2875 1.5210 3.3766 1.3193 19.7543 0.7461 7.3977 0.0343 2.0002 4.5020 20.0083 2.4974 2.6834 36.2604 20.4828 13.4766 31.3660 11.7267 99.4425 39.9400 17.8817 7.4686 4.7403 76.8703 107.3696 53.4068 2.1603 6.8562 27.6940 2.9279 19.4702 2.0117 24.0411 3.8477 35.5813 18.3383 3.0636 3.9679 3.5807 1.3017 0.9044 0.3588 0.5920 1.0299 2.2995 11.6682 3.2661 22.6511 14.0413 8.8032 3.3842 1.1763 2.6282 2.1480 2.5987 1.7445 0.6402 7.8246 29.1137 3.4671 6.5222 8.2132 2.0694 6.5015 4.3485 3.2650 4.3308 13.1789 9.5604 3.5200 4.5113 15.2733 3.8621 11.4513 7.3854 0.9871 11.9739 37.6128 10.9420 23.6962 1.0862 1.2475 0.3635 16.6311 1.8279 4.9272 2.3103 10.0318 1.0787 2.1976 1.7410 6.5972 1.3023 17.1818 4.1589 8.5228 2.1708 24.7331 18.9482 48.6000 18.1411 13.4537 33.6480 36.9961 20.9619
temp: 298.150 k
press: 1.00000 atm
elementType: 16 16 8 8 7 6 6 6 6 6 6 6 6 6 6 6 6 6 6 6 6 6 6 6 6 6 6 6 6 6 6 1 1 1 1 1 1 1 1 1 1 1 1 1 1 1 1 1
symmnumber: 1
zpe: 920654.6 jmol-1
zpe.correction: 0.350659 hartree
zpe.thermalcorrener: 0.375204 hartree
zpe.thermalcorrenthalpy: 0.376148 hartree
zpe.thermalcorrgfe: 0.295148 hartree
zpe.sumelectzpe: -2000.108939 hartree
zpe.sumelectthermal: -2000.084394 hartree
zpe.sumelectthermalent: -2000.083449 hartree
zpe.sumelectthermalfe: -2000.164450 hartree
dipole: 3.6403 1.2743 1.1746
dipole: 4.0317
quadrupole: -162.5487 -183.6366 -176.3907
quadrupole: -0.5753 6.1527 -1.8737
quadrupole: 11.6433 -9.4446 -2.1987 -0.5753 6.1527 -1.8737
hfenergy: -2000.4595978 hartree
pointgroup: C01 [X(C26H17N1O2S2)]
dipole: -0.7966665 1.3699454 0.0679984 debye
polarizability: 537.3558578|-112.2202922|347.6434022|-31.0536336|25.2465637|312.2976785 unknown
InChI: InChI=1S/C26H17NO2S2/c28-31(20-10-2-1-3-11-20)29-26-22-13-7-5-9-19(22)15-17-24(26)27-25-21-12-6-4-8-18(21)14-16-23(25)30-26/h1-17H
charge 0 multiplicity 1
48 atoms
S  1.081719 1.381585 -0.046284
S  -0.931775 -1.984135 0.929691
O  2.215719 0.680374 0.905266
O  -0.762025 0.789752 0.497698
N  0.263639 -1.181242 -1.879898
C  1.121159 -1.837956 -0.999696
C  -0.910177 -0.650378 -1.538584
C  -1.362477 -0.401874 -0.091834
C  0.720158 -2.318592 0.27612
C  2.460966 -2.15116 -1.479142
C  -2.85533 -0.145547 0.090066
C  3.338192 -2.953921 -0.662155
C  -1.787619 -0.211745 -2.608466
C  -3.664856 0.188867 -1.040301
C  1.585142 -3.14264 1.057917
C  0.733606 3.014141 0.822365
C  -3.086434 0.182782 -2.378647
C  2.864951 -3.445599 0.601973
C  2.927272 -1.685378 -2.745952
C  -3.417174 -0.125402 1.387347
C  4.656961 -3.250856 -1.133483
C  -5.034525 0.515971 -0.834517
C  4.220404 -1.992939 -3.185899
C  -0.259078 3.87472 0.3137
C  1.519093 3.333318 1.943803
C  5.09561 -2.777395 -2.37368
C  -4.779418 0.192564 1.574439
C  -5.590434 0.51615 0.458587
C  -0.467095 5.112529 0.963902
C  1.297782 4.57252 2.58528
C  0.309565 5.459652 2.095498
H  -1.372482 -0.270483 -3.619395
H  1.242219 -3.506072 2.032361
H  -3.729096 0.47099 -3.219025
H  3.533717 -4.05784 1.218117
H  2.243669 -1.091938 -3.359185
H  -2.780856 -0.345107 2.250761
H  5.319568 -3.856542 -0.503703
H  -5.656429 0.767937 -1.701847
H  4.56598 -1.632126 -4.161146
H  -0.869405 3.585696 -0.548113
H  2.269846 2.615666 2.294884
H  6.106526 -3.007985 -2.727248
H  -5.204939 0.197019 2.583361
H  -6.646597 0.768319 0.602582
H  -1.236435 5.797636 0.592405
H  1.893636 4.843954 3.463177
H  0.143358 6.420111 2.595792
