program: Gaussian 09
title: 000255488
version: EM64L-G09RevD.01
frameworkgroup: C1[X(C13H14O4)]
method: RPBEPBE
basis: SDD
operation: Freq
keyword: #pfreq=noraman
keyword: PBEPBE/SDD
title: #p freq=noraman PBEPBE/SDD
converged: YES YES NO NO
title: Mulliken charges:
elementType: O O O O C C C C C C C C C C C C C H H H H H H H H H H H H H H
charge: -0.223638 -0.287687 -0.255839 -0.242207 -0.554943 0.174037 -0.302702 -0.340414 0.342065 0.156587 0.156610 -0.504081 0.305393 -0.370894 -0.373924 -0.534453 -0.537598 0.245625 0.241889 0.229371 0.225019 0.261507 0.341158 0.238060 0.241798 0.222750 0.243666 0.222691 0.248341 0.215839 0.215972
chargesum: 0.00000
title: Mulliken charges with hydrogens summed into heavy atoms:
elementType: O O O O C C C C C C C C C C C C C
charge: -0.223638 -0.287687 -0.255839 -0.242207 -0.067429 0.174037 0.151688 -0.078906 0.342065 0.156587 0.156610 -0.162922 0.305393 -0.132834 -0.132126 0.154654 0.142555
polarizability: 2.58497581e+02 2.01883867e+00 1.84948692e+02 -1.22655516e+00 3.52773384e-01 8.03302165e+01
1716.lowfreq: 0.0003 0.0005 0.0005 3.8024 6.5051 10.1892 36.5896 50.7595 76.5180
frequency: 36.5843 50.7571 76.5167 91.1908 96.4822 111.7164 164.6224 171.7002 175.2885 203.7345 233.2776 256.6939 262.7097 280.7340 313.5043 357.4404 371.3197 389.0431 455.2302 481.7085 517.9217 544.8506 585.8127 589.5522 650.2790 661.5727 683.9565 718.7769 736.2317 755.9187 772.9277 797.2412 842.8916 905.4209 916.9427 934.7015 950.8507 974.9526 985.0030 991.9042 1014.1025 1022.2350 1058.6277 1111.8339 1114.6537 1119.0137 1144.0510 1154.6906 1158.2904 1169.4496 1189.5413 1203.2717 1210.1609 1243.3015 1282.0017 1305.9932 1337.5880 1364.4680 1400.3794 1433.6761 1440.0094 1442.3132 1458.8171 1467.5547 1468.5753 1469.9892 1474.5623 1486.3024 1486.5654 1572.6912 1613.0033 1635.1114 1660.3955 2950.7204 2960.0978 2989.1673 3017.3132 3035.2319 3048.1803 3069.2063 3106.0187 3107.4238 3123.2388 3123.5329 3146.8355 3151.7634 3172.7250
redmass: 5.0513 3.9556 3.2294 3.3777 5.5784 3.4218 3.7810 3.4059 3.7357 6.5169 1.1124 4.1131 1.1515 3.3846 3.6582 4.3112 6.2088 3.9915 6.8099 3.1626 5.0377 4.8929 6.0682 3.3104 3.6428 4.9760 5.8098 6.4529 6.7676 3.8677 5.9117 1.5234 1.7226 1.4087 5.1699 3.0505 1.5278 1.4757 4.5181 6.8215 3.7777 4.3354 1.6404 1.2609 1.2582 2.5851 1.4918 2.0239 1.6280 1.2800 1.4279 1.5628 2.0979 4.1273 1.3718 1.4525 1.3194 3.3663 2.4692 1.3721 1.5014 1.4860 1.0913 1.0508 1.0538 1.2443 1.1507 1.0978 1.6288 6.1206 7.4120 7.6818 9.8471 1.0336 1.0328 1.0653 1.0637 1.1036 1.1039 1.0969 1.1034 1.0888 1.0986 1.0994 1.0939 1.0874 1.0951
irintensity: 4.3285 6.4075 3.7528 0.2975 3.7426 4.7876 5.7284 3.2561 1.8884 5.6785 0.0479 4.7074 0.6414 0.3452 6.0624 0.3819 3.5891 0.1600 0.1185 4.7977 0.3492 2.9380 11.6883 6.0549 1.5660 2.2672 33.1649 6.7051 8.8137 4.4546 10.3961 56.9708 21.2659 0.0872 15.7743 41.6630 7.8692 35.2266 291.2728 36.6329 81.3442 69.1963 18.5762 0.2600 0.2955 116.7303 7.2601 64.6442 44.6059 13.5985 69.2034 86.8602 170.0333 46.9994 10.3443 26.8015 0.2081 4.2101 101.9790 55.0201 5.6908 67.1212 12.7539 13.6471 19.0488 181.4537 14.0471 4.6612 58.7718 53.3483 46.1249 139.2759 115.1931 77.1300 85.5757 22.7246 70.6358 54.8485 47.3104 21.2372 40.2911 5.1803 38.4602 5.9031 56.7931 14.4077 17.1945
temp: 298.150 k
press: 1.00000 atm
elementType: 8 8 8 8 6 6 6 6 6 6 6 6 6 6 6 6 6 1 1 1 1 1 1 1 1 1 1 1 1 1 1
symmnumber: 1
zpe: 638881.5 jmol-1
zpe.correction: 0.243337 hartree
zpe.thermalcorrener: 0.259439 hartree
zpe.thermalcorrenthalpy: 0.260384 hartree
zpe.thermalcorrgfe: 0.199133 hartree
zpe.sumelectzpe: -803.381678 hartree
zpe.sumelectthermal: -803.365576 hartree
zpe.sumelectthermalent: -803.364632 hartree
zpe.sumelectthermalfe: -803.425883 hartree
dipole: -3.0790 6.2198 0.3308
dipole: 6.9481
quadrupole: -70.7157 -96.3156 -101.1517
quadrupole: 12.8972 -0.2098 -0.1285
quadrupole: 18.6786 -6.9213 -11.7573 12.8972 -0.2098 -0.1285
hfenergy: -803.6250155 hartree
pointgroup: C01 [X(C13H14O4)]
dipole: 0.4646143 -2.6904353 -0.1348059 debye
polarizability: 252.0981753|-19.7597324|188.7395935|15.1312761|9.9400794|82.9387207 unknown
InChI: InChI=1S/C13H14O4/c1-15-11-3-4-12(16-2)10(8-11)7-9-5-6-17-13(9)14/h3-4,7-8H,5-6H2,1-2H3
charge 0 multiplicity 1
31 atoms
O  -3.472429 2.546812 -0.069636
O  -0.020232 -2.846636 -0.491799
O  3.05283 1.804398 0.31769
O  -1.17239 2.778292 -0.078159
C  -3.726255 0.23859 -0.723811
C  -2.25583 0.549124 -0.448616
C  -4.46649 1.435118 -0.084033
C  -1.286123 -0.428001 -0.471323
C  0.165856 -0.441824 -0.264547
C  -2.155179 2.014419 -0.184259
C  0.816628 -1.732283 -0.285166
C  0.976674 0.704207 -0.057487
C  2.373586 0.588768 0.124903
C  2.208425 -1.838188 -0.102864
C  2.995477 -0.681245 0.104144
C  0.600955 -4.170179 -0.528721
C  4.501036 1.742306 0.509536
H  -3.913769 0.210201 -1.814778
H  -4.049184 -0.727023 -0.300068
H  -5.337147 1.788734 -0.65685
H  -4.760559 1.235907 0.962319
H  -1.67457 -1.434658 -0.679402
H  0.520348 1.698298 -0.044471
H  2.701915 -2.813876 -0.1173
H  4.075202 -0.790245 0.24258
H  1.335954 -4.247088 -1.353583
H  -0.227689 -4.87208 -0.704091
H  1.094946 -4.40959 0.433106
H  4.818165 2.787386 0.6394
H  5.009583 1.306962 -0.373909
H  4.766166 1.158698 1.413792
