program: Gaussian 09
title: 000255480
version: EM64L-G09RevD.01
frameworkgroup: C1[X(C12H11NO5)]
method: RPBEPBE
basis: SDD
operation: Freq
keyword: #p
keyword: freq=noraman
keyword: PBEPBE/SDD
title: #p freq=noraman PBEPBE/SDD
converged: YES YES NO NO
title: Mulliken charges:
elementType: O O O O O N C C C C C C C C C C C C H H H H H H H H H H H
charge: -0.215498 -0.271163 -0.244094 -0.202335 -0.193999 0.019005 -0.553425 0.168142 -0.301608 -0.348418 0.528558 0.162442 -0.561964 -0.376401 0.255175 0.210504 -0.334125 -0.513161 0.254461 0.247583 0.237044 0.232233 0.224263 0.276323 0.325781 0.260431 0.241532 0.257435 0.215281
chargesum: 0.00000
title: Mulliken charges with hydrogens summed into heavy atoms:
elementType: O O O O O N C C C C C C C C C C C C
charge: -0.215498 -0.271163 -0.244094 -0.202335 -0.193999 0.019005 -0.051381 0.168142 0.167669 -0.124155 0.528558 0.162442 -0.285642 -0.050621 0.255175 0.210504 -0.073694 0.201087
polarizability: 2.96086528e+02 1.28723383e+01 1.62700264e+02 -2.00409448e+00 1.24968335e-01 7.83629241e+01
1716.lowfreq: -5.3144 -2.2986 -0.0003 0.0002 0.0005 4.7455 28.9813 37.9711 44.7356
frequency: 28.9055 37.9668 44.7173 81.9963 89.5449 112.7020 133.1994 150.2055 168.4938 176.7897 187.4790 234.6640 248.2827 275.5496 339.8107 352.1786 384.1217 408.0862 442.5027 479.0067 534.7481 553.1886 588.4028 640.8593 652.2539 676.0251 693.2733 711.3369 729.3127 746.4315 761.0946 777.4303 839.3745 869.8276 899.5023 909.9355 933.7590 950.1271 952.1049 997.1631 1023.3066 1023.7237 1056.4162 1071.4541 1101.4903 1148.9112 1150.6181 1160.3612 1169.4033 1194.7741 1206.4291 1234.3925 1235.2881 1270.7560 1288.3770 1339.1833 1349.2333 1366.5309 1407.0857 1426.6900 1429.3985 1453.2531 1455.9322 1478.0862 1486.7212 1487.3370 1543.5655 1605.8075 1641.0592 1660.3351 2978.4573 2993.5033 3026.3693 3070.6635 3074.3662 3088.0330 3115.3986 3138.3193 3144.4553 3153.8507 3163.2660
redmass: 5.9109 5.0935 6.3158 3.7616 4.6624 5.1154 3.0329 1.1796 3.8107 6.3936 4.7936 7.2170 4.2983 5.6440 6.5504 6.2491 5.3923 3.3843 5.1263 7.1229 6.8338 4.6343 4.0187 7.9935 3.5620 5.5763 7.4190 7.1326 6.7226 5.5595 4.5228 6.8907 1.7347 1.4293 1.4378 4.4350 3.4816 4.3349 2.0457 3.6108 2.3786 1.9069 1.6411 3.3390 1.2304 1.5035 2.1914 1.7043 1.2154 1.3479 3.6029 3.7979 2.2311 1.7348 1.6089 1.3286 2.6657 9.1405 2.2367 1.3497 2.1170 1.0653 1.0880 1.0541 1.0878 2.6998 6.6303 6.6477 8.9341 9.3883 1.0329 1.0648 1.0638 1.0946 1.0901 1.1011 1.1062 1.1034 1.0926 1.0915 1.0957
irintensity: 4.8180 0.5716 7.3548 2.7317 5.8696 5.6375 0.6202 0.2920 4.4216 1.2734 4.8142 5.6015 2.1696 8.0464 0.7418 0.2206 1.7739 1.0891 3.6784 1.2137 27.2193 8.9259 17.3666 4.3185 4.8201 5.8312 10.1179 4.7395 12.7271 10.8619 7.6362 6.6020 12.6786 27.7583 7.8043 27.5109 27.8335 64.4564 63.9858 170.3353 164.2663 90.2633 10.8535 31.7380 1.4703 41.8592 51.0598 144.4449 15.8235 4.8524 169.4478 123.7932 65.3744 45.4194 10.3765 0.5805 6.1375 99.8960 26.4497 39.9795 28.5814 12.0096 11.8920 17.4412 5.1568 161.9842 7.3212 106.8354 115.1308 124.2700 74.3527 15.0712 59.7279 5.8153 27.1272 23.7366 26.2162 19.2261 40.9186 2.8555 17.5631
temp: 298.150 k
press: 1.00000 atm
elementType: 8 8 8 8 8 7 6 6 6 6 6 6 6 6 6 6 6 6 1 1 1 1 1 1 1 1 1 1 1
symmnumber: 1
zpe: 557489.4 jmol-1
zpe.correction: 0.212337 hartree
zpe.thermalcorrener: 0.228771 hartree
zpe.thermalcorrenthalpy: 0.229715 hartree
zpe.thermalcorrgfe: 0.166455 hartree
zpe.sumelectzpe: -893.323032 hartree
zpe.sumelectthermal: -893.306598 hartree
zpe.sumelectthermalent: -893.305654 hartree
zpe.sumelectthermalfe: -893.368914 hartree
dipole: 3.5232 1.3713 1.9733
dipole: 4.2646
quadrupole: -106.5972 -106.8219 -103.6528
quadrupole: 35.7077 -2.7524 -1.3720
quadrupole: -0.9066 -1.1313 2.0379 35.7077 -2.7524 -1.3720
hfenergy: -893.5353687 hartree
pointgroup: C01 [X(C12H11N1O5)]
dipole: -1.441347 0.7640082 -0.3923257 debye
polarizability: 297.0383457|1.6575924|137.7469532|-7.6066818|37.5041308|102.364417 unknown
InChI: InChI=1S/C12H11NO5/c1-17-11-3-2-8(7-10(11)13(15)16)6-9-4-5-18-12(9)14/h2-3,6-7H,4-5H2,1H3
charge 0 multiplicity 1
29 atoms
O  -4.84448 -1.118696 -0.559492
O  3.675473 -1.346473 -0.183496
O  -2.823403 -2.21429 -0.782449
O  2.831943 2.11501 1.971472
O  4.218755 1.358298 0.32872
N  3.103777 1.33418 0.977274
C  -4.232054 0.742783 0.85186
C  -2.984615 -0.007046 0.392931
C  -5.334422 0.212845 -0.09449
C  -1.712188 0.430149 0.674621
C  -0.362058 -0.074484 0.381417
C  -3.444559 -1.2157 -0.360326
C  0.719471 0.752695 0.789872
C  -0.046161 -1.316044 -0.256169
C  2.055961 0.383808 0.54568
C  2.373295 -0.859081 -0.079308
C  1.291673 -1.690697 -0.462584
C  4.388901 -1.107332 -1.461243
H  -4.468527 0.481143 1.901119
H  -4.124751 1.838709 0.793166
H  -6.306593 0.044482 0.391854
H  -5.464929 0.848318 -0.988087
H  -1.687923 1.375853 1.239756
H  0.537582 1.703213 1.302719
H  -0.858379 -1.980086 -0.565407
H  1.531646 -2.662229 -0.906665
H  5.343719 -1.642394 -1.357539
H  4.567138 -0.027011 -1.59172
H  3.810109 -1.520924 -2.309187
