program: Gaussian 09
title: 000255478
version: EM64L-G09RevD.01
frameworkgroup: C1[X(C9H7BrO4)]
method: RPBEPBE
basis: SDD
operation: Freq
keyword: #p
keyword: freq=noraman
keyword: PBEPBE/SDD
title: #p freq=noraman PBEPBE/SDD
converged: YES YES NO NO
title: Mulliken charges:
elementType: Br O O O O C C C C C C C C C H H H H H H H
charge: 0.033990 -0.364562 -0.178257 -0.444692 -0.210621 0.329635 0.139762 -0.415814 -0.313392 0.185907 -0.399174 0.199190 -0.815190 0.114293 0.329347 0.243525 0.229117 0.291358 0.291417 0.365350 0.388812
chargesum: 0.00000
title: Mulliken charges with hydrogens summed into heavy atoms:
elementType: Br O O O O C C C C C C C C C
charge: 0.033990 0.000788 -0.178257 -0.055880 -0.210621 0.329635 0.139762 -0.086467 -0.069868 0.185907 -0.170058 0.199190 -0.232415 0.114293
polarizability: 2.09664398e+02 -1.31463977e+01 1.35550042e+02 3.51017820e-02 -1.00228729e-02 5.08669484e+01
1716.lowfreq: -3.8395 -0.0006 0.0003 0.0006 3.0338 9.1548 20.6991 28.8466 62.8426
frequency: 20.6990 28.8374 62.8134 81.4045 101.8822 147.5663 169.1465 186.1412 268.9307 284.6557 329.4639 379.5345 416.1016 438.9573 444.2074 492.2950 518.6980 565.7170 572.9013 601.6395 614.9152 671.8868 701.1322 724.5962 752.6394 771.7867 808.0514 859.6906 885.5517 952.7847 987.5619 993.9243 1021.2883 1092.0851 1133.1136 1134.6303 1176.3562 1203.0024 1258.2625 1272.7801 1291.8560 1308.0194 1392.5698 1409.3581 1415.2500 1496.5293 1580.1724 1598.0157 1622.9152 1655.0488 3030.7766 3106.5806 3120.8426 3158.5965 3182.9885 3536.1873 3543.0996
redmass: 12.9918 12.1162 3.3240 9.7517 4.6948 4.8333 14.3798 8.8959 9.2016 5.4185 7.5265 10.2733 1.9095 7.3779 1.4838 2.9224 4.5630 1.7881 7.9970 1.5304 5.1061 6.2178 4.6917 6.4643 6.0191 3.7820 1.6373 6.6625 1.8799 1.4331 5.0263 1.4299 3.1902 1.9478 1.1172 1.4697 1.2919 1.6459 1.7452 3.1329 1.4929 2.5518 4.9991 1.1087 5.7415 2.7835 7.5160 6.7228 8.6867 8.9773 1.0566 1.1066 1.0892 1.0946 1.0918 1.0643 1.0659
irintensity: 2.2175 0.3526 7.2134 0.4747 0.1138 2.0684 0.0501 2.3158 0.6519 1.3443 5.0613 2.9617 85.2224 8.4094 44.7497 9.1177 44.1626 15.0597 67.0214 155.5885 35.2523 16.1421 15.8155 4.3571 10.3432 0.2834 65.7416 16.2246 5.1705 0.1574 217.4411 8.6273 36.7591 230.1873 3.2399 101.3747 59.3471 244.1712 69.8990 31.5251 44.2458 68.9002 3.8044 16.4750 3.2466 35.4880 86.9703 90.1355 48.9032 379.6503 24.0712 1.3219 12.8653 9.1297 8.8840 48.5941 60.1233
temp: 298.150 k
press: 1.00000 atm
elementType: 35 8 8 8 8 6 6 6 6 6 6 6 6 6 1 1 1 1 1 1 1
symmnumber: 1
zpe: 374290.2 jmol-1
zpe.correction: 0.142560 hartree
zpe.thermalcorrener: 0.155941 hartree
zpe.thermalcorrenthalpy: 0.156885 hartree
zpe.thermalcorrgfe: 0.099222 hartree
zpe.sumelectzpe: -660.499075 hartree
zpe.sumelectthermal: -660.485694 hartree
zpe.sumelectthermalent: -660.484749 hartree
zpe.sumelectthermalfe: -660.542412 hartree
dipole: -1.4032 5.5002 -0.0012
dipole: 5.6764
quadrupole: -109.2680 -71.8157 -90.4631
quadrupole: 1.5624 -0.0136 0.0196
quadrupole: -18.7524 18.6999 0.0525 1.5624 -0.0136 0.0196
hfenergy: -660.6416344 hartree
pointgroup: C01 [X(C9H7Br1O4)]
dipole: -0.4739132 -2.1823781 -0.0088337 debye
dipolederiv: -0.441638 -0.0648938 0.0033451 -0.1378036 -0.0710905 0.001544 0.0025418 0.000703 -0.0928311 -1.211005 -0.7192361 0.0050873 -0.6045023 -0.372557 0.0072057 0.0061057 0.0086139 -0.3681544 -0.6997102 -0.0798661 0.0043525 -0.375905 -0.8215454 0.0018278 0.0026114 -0.0019321 -0.2818213 -0.3131292 -0.1410579 -0.0024535 0.0491411 -1.2824545 -0.0058912 -0.0012452 -0.003648 -0.4273149 -1.1041571 -0.0271371 0.0099114 0.1897414 -0.5601324 -0.0039061 0.0114618 -0.0011735 -0.3109272 -1.0212235 -0.1415787 0.0105469 0.0219665 -0.3929704 -0.0022623 0.0115166 -0.0004973 -0.0502336 -0.652257 0.2473571 0.0092699 -0.0756249 -0.444252 -0.00191 0.0073921 -0.0059093 -0.0272006 0.455961 -0.1199487 -0.0067774 -0.1200579 -0.006128 0.0015832 -0.0064483 0.0016831 -0.0344424 0.2584157 0.1826989 -0.0029069 0.2286011 0.2915626 -0.0001954 -0.0031376 0.0002196 -0.0901032 1.2349053 0.6858409 -0.0086252 0.2935826 0.5029405 -0.000826 -0.0115465 -0.0055312 0.1144473 -0.6813422 -0.2644337 0.0040275 0.2228488 0.111175 -0.0006194 0.0074434 0.0051602 -0.1929369 1.7029313 0.2488962 -0.0167498 0.0463223 0.843221 0.0024109 -0.0181559 0.0008484 0.1260264 0.3493773 0.3004803 -0.0006109 0.6558639 -0.043407 -0.007809 0.0024598 -0.003902 0.0915158 1.5393627 -0.1804387 -0.017754 -0.4638549 1.6562342 0.014675 -0.0197655 0.0113899 0.2402146 0.1834421 -0.0398867 -0.0006605 0.0037325 0.095468 -0.0004635 -0.0004399 0.0001038 0.1512792 -0.0047202 0.0994691 0.0024291 0.1259228 0.0528421 -0.0020428 0.0026369 -0.0017215 0.1390808 0.0323086 -0.078146 0.0011425 -0.0531509 -0.0932543 -0.0011537 0.0012721 -0.000836 0.1720095 -0.0567991 -0.0896009 0.0565252 -0.0671314 0.0174542 0.0779469 0.0404538 0.070819 0.0296006 -0.0586629 -0.0901484 -0.0557685 -0.0680609 0.0194978 -0.0766189 -0.0398797 -0.0690212 0.0298023 0.3806023 0.1931843 0.0013439 0.1416139 0.1353429 -0.0033659 0.0009482 -0.0040217 0.3816452 0.1073381 0.0784459 0.0043255 -0.0132449 0.3620534 -0.0001293 0.003775 -0.0013469 0.4003441 unknown
polarizability: 208.6026777|15.7852694|136.5887686|-1.7426664|0.3871945|50.8899413 unknown
InChI: InChI=1S/C9H7BrO4/c10-4-8(12)5-1-2-7(11)6(3-5)9(13)14/h1-3,11,13H,4H2
charge 0 multiplicity 1
21 atoms
Br 5.3072 0.377359 -0.018886
O  -2.952655 -1.784158 0.060601
O  2.483831 1.673764 0.016517
O  -2.180244 2.428938 0.079732
O  -3.847476 0.817598 0.090775
C  0.9791 -0.209422 0.023786
C  -1.474406 0.144648 0.055864
C  -0.151773 0.643627 0.043042
C  0.766266 -1.61606 0.017129
C  -1.663356 -1.274779 0.048541
C  -0.535248 -2.13827 0.029218
C  2.340826 0.423806 0.011625
C  3.535196 -0.5453 -0.006882
C  -2.627173 1.090824 0.076753
H  0.009038 1.724903 0.048236
H  1.609079 -2.314625 0.002495
H  -0.689527 -3.224824 0.023831
H  3.532731 -1.189103 0.888705
H  3.514586 -1.177275 -0.910647
H  -2.943653 -2.775993 0.053726
H  -2.976744 3.024044 0.094138
