program: Gaussian 09
title: 000255451
version: EM64L-G09RevD.01
frameworkgroup: C1[X(C9H5N3O5)]
method: RPBEPBE
basis: SDD
operation: Freq
keyword: #pfreq=noraman
keyword: PBEPBE/SDD
title: #p freq=noraman PBEPBE/SDD
converged: YES YES NO NO
title: Mulliken charges:
elementType: O O O O O N N N C C C C C C C C C H H H H H
charge: -0.193783 -0.392165 -0.203336 -0.193138 -0.191257 -0.407894 0.057517 0.021868 0.405975 0.071305 -0.494644 -0.347630 0.426682 -0.358250 -0.027666 0.088211 0.124236 0.322374 0.250559 0.347437 0.297425 0.396173
chargesum: 0.00000
title: Mulliken charges with hydrogens summed into heavy atoms:
elementType: O O O O O N N N C C C C C C C C C
charge: -0.193783 0.004008 -0.203336 -0.193138 -0.191257 -0.060456 0.057517 0.021868 0.405975 0.071305 -0.172270 -0.097071 0.426682 -0.060825 -0.027666 0.088211 0.124236
polarizability: 2.63013508e+02 -7.04016857e+00 1.38678873e+02 1.65683575e+00 2.58307246e+00 6.24286900e+01
1716.lowfreq: -7.5305 -2.7808 -0.0007 -0.0006 -0.0004 3.6168 21.4364 52.1589 69.4806
frequency: 21.4106 52.1526 69.4802 79.8150 109.4083 162.1126 182.2004 198.0820 273.3174 292.6277 308.3196 354.9174 377.0865 448.4941 468.8862 500.1076 513.5553 531.6159 550.9249 563.0351 589.2774 619.4595 682.3268 689.5249 698.9174 723.0917 744.1013 755.1243 768.1736 800.2114 846.1288 860.1144 932.8975 953.1076 987.3484 1014.3904 1068.0991 1093.2719 1141.8259 1194.2603 1211.1081 1230.9062 1258.5814 1273.6197 1323.1377 1364.5687 1380.2603 1424.6938 1464.8515 1470.6870 1542.3076 1580.4018 1617.1047 1631.2475 1665.8240 3146.0895 3188.3623 3193.3475 3496.7954 3510.2250
redmass: 10.4569 11.8885 12.0521 7.3528 8.4884 7.9455 9.4958 6.1992 10.7727 11.6509 8.4518 8.2318 4.9853 4.9616 3.3693 5.9122 5.1054 6.2086 5.4785 5.6120 2.0154 3.4735 5.7387 5.3648 5.7757 6.2665 2.2332 2.3186 10.4966 5.9750 1.6014 4.6309 5.8693 1.4655 1.3416 5.5694 2.1125 2.5664 1.5095 4.0747 8.1584 2.1325 2.0212 2.1270 3.9182 4.8296 4.3640 6.0256 3.1138 4.2476 10.8766 7.8057 6.6029 6.7518 10.2944 1.0911 1.0948 1.0935 1.0773 1.0641
irintensity: 1.7430 0.2431 4.5779 2.0257 0.3468 0.1488 8.4995 1.3993 0.7146 1.0870 3.7313 1.3288 0.6605 11.2619 8.6850 5.2462 4.6160 7.5708 90.2892 3.7940 96.0835 40.8644 6.9550 10.9823 10.5816 21.5872 45.3863 30.7031 24.5590 3.9883 71.6153 2.1161 12.7758 21.8261 0.3620 302.7466 25.3243 81.9732 34.0321 20.0839 445.3338 1.2845 10.6515 8.3693 66.9741 36.1948 59.4179 6.6080 14.4275 18.3860 6.6629 13.3320 290.9010 324.5202 212.5168 5.1801 4.0667 10.2614 51.1724 48.4758
temp: 298.150 k
press: 1.00000 atm
elementType: 8 8 8 8 8 7 7 7 6 6 6 6 6 6 6 6 6 1 1 1 1 1
symmnumber: 1
zpe: 366017.3 jmol-1
zpe.correction: 0.139409 hartree
zpe.thermalcorrener: 0.153162 hartree
zpe.thermalcorrenthalpy: 0.154107 hartree
zpe.thermalcorrgfe: 0.096944 hartree
zpe.sumelectzpe: -885.070875 hartree
zpe.sumelectthermal: -885.057121 hartree
zpe.sumelectthermalent: -885.056177 hartree
zpe.sumelectthermalfe: -885.113339 hartree
dipole: -0.9335 4.4811 1.3887
dipole: 4.7834
quadrupole: -122.2680 -90.4139 -98.2829
quadrupole: 15.0901 -7.9569 -4.2920
quadrupole: -18.6130 13.2410 5.3720 15.0901 -7.9569 -4.2920
hfenergy: -885.2102833 hartree
pointgroup: C01 [X(C9H5N3O5)]
dipole: -0.378641 1.7400226 0.6087451 debye
dipolederiv: -1.2922481 0.2265963 -0.0158447 0.5448799 -0.5683468 0.004902 -0.0307275 0.0042377 -0.3380828 -0.6856663 -0.012384 0.4407026 -0.1055223 -0.3492515 0.1046329 0.5493593 0.0930255 -0.9996867 -1.0257301 -0.0920404 0.0022414 -0.1193689 -0.4897233 -0.0061039 0.0025208 -0.0065118 -0.2264701 -0.5950944 0.1242589 0.0058698 0.3157329 -0.8298501 -0.0173539 0.0116392 -0.0173895 -0.218819 -0.6939975 -0.2569023 -0.1457153 -0.3284825 -0.505914 -0.2788952 0.1064804 -0.0893224 -0.7899913 -1.2623453 0.4067424 -0.0024461 -0.2486372 -0.255907 -0.0034977 -0.0122332 0.0027016 -0.2875697 0.254718 -0.0298461 -0.0184537 0.1923394 -0.1797813 0.0087911 -0.0597046 -0.0308792 -0.1920973 2.0085609 -0.2863981 -0.0180804 -0.5328912 1.2089612 0.0290484 -0.0291867 0.0297428 0.1897906 0.8076971 -0.4627847 -0.0122189 -0.1967192 0.2124856 0.0006032 -0.0061694 0.0001989 0.1512074 -0.3384796 0.1338001 0.0014794 0.0333171 -0.1874772 -0.0046524 0.0530828 0.0204052 0.0457009 0.6423172 -0.1242119 -0.0047005 0.0105239 -0.0021221 0.0021706 -0.0015102 0.0083712 -0.0677658 -0.4737611 0.2049027 0.0070938 -0.0429333 0.149823 0.0110319 -0.003004 0.0023926 -0.1758847 -0.9326517 0.2339329 0.0101386 0.075219 -0.2386813 -0.0081394 0.002529 -0.0128916 0.0438635 0.0649871 -0.0818924 -0.0041577 -0.1723382 0.1981213 0.0095759 -0.0042301 0.0091422 -0.0790608 -0.0588263 0.0518399 0.0441738 0.5772308 0.1115775 -0.0069875 0.0073507 -0.0239583 0.01535 1.6978869 -0.3500767 0.0342774 -0.4348835 0.5047144 -0.0176955 0.0995596 0.0161337 0.3005917 1.2243604 0.4606918 -0.2778225 0.5953956 0.5614853 0.2541832 -0.5410691 0.0896533 1.4770417 0.1468875 0.0044837 -0.000507 -0.0189259 0.1021189 -0.0021954 0.0026464 -0.0008205 0.1703863 0.0627639 0.0505624 0.0022102 0.0069792 -0.0627648 -0.0065032 0.0001591 -0.0064627 0.1691178 0.1253667 -0.0366727 -0.0008713 -0.0533874 0.2097492 -0.0014657 -0.0131795 -0.0005758 0.3217261 0.0883357 -0.0583472 -0.0012997 -0.0098795 0.1185567 -0.0014586 0.0002935 -0.0007288 0.170439 0.2349191 -0.1062546 -0.0460695 -0.0876489 0.2922264 -0.069991 -0.1346065 -0.0864642 0.3202131 unknown
polarizability: 263.1575605|-5.3436607|138.2766069|-2.4868729|5.0887715|62.6869039 unknown
InChI: InChI=1S/C9H5N3O5/c13-8-7(9(14)15)10-6-3-4(12(16)17)1-2-5(6)11-8/h1-3,11,14H
charge 0 multiplicity 1
22 atoms
O  -3.435405 1.702774 -0.003576
O  -4.005839 -1.194192 1.207966
O  5.011995 0.002541 -0.042337
O  3.977129 -2.032596 -0.092323
O  -3.774997 -1.858212 -1.015487
N  -1.098721 1.83053 0.048248
N  -0.952856 -0.978123 -0.019895
N  3.956884 -0.743508 -0.056152
C  0.161881 1.240354 0.02701
C  0.215582 -0.196662 -0.015281
C  1.470672 -0.847834 -0.04305
C  1.359832 2.003406 0.043264
C  2.637494 -0.069028 -0.027821
C  2.597677 1.35023 0.015511
C  -2.123086 -0.366236 0.007951
C  -2.32126 1.114344 0.021594
C  -3.37278 -1.217417 -0.026491
H  1.515272 -1.938958 -0.075574
H  1.315235 3.09743 0.075759
H  -1.18723 2.852964 0.067509
H  3.53884 1.905679 0.026146
H  -4.851718 -1.719485 1.174631
