program: Gaussian 09
title: 000255441
version: EM64L-G09RevD.01
frameworkgroup: C1[X(C6H8N4O3)]
method: RPBEPBE
basis: SDD
operation: Freq
keyword: #pfreq=noraman
keyword: PBEPBE/SDD
title: #p freq=noraman PBEPBE/SDD
converged: YES YES NO NO
title: Mulliken charges:
elementType: O O O N N N N C C C C C C H H H H H H H H
charge: -0.255467 -0.198019 -0.227797 -0.238674 -0.382844 -0.392139 -0.031355 0.414367 -0.053294 0.210440 -0.673250 0.166253 -0.586121 0.307726 0.243940 0.244076 0.340787 0.365587 0.273279 0.198851 0.273655
chargesum: 0.00000
title: Mulliken charges with hydrogens summed into heavy atoms:
elementType: O O O N N N N C C C C C C
charge: -0.255467 -0.198019 -0.227797 -0.238674 -0.042057 -0.026552 -0.031355 0.414367 -0.053294 0.210440 0.122491 0.166253 0.159665
polarizability: 1.48940207e+02 -7.35668138e+00 1.32298539e+02 -8.33015880e-02 -5.82636032e-02 5.14582570e+01
1716.lowfreq: -13.3110 -9.2152 -0.9533 0.0009 0.0012 0.0012 14.0482 62.4339 111.9350
frequency: 12.6268 62.4310 111.9244 154.5438 168.3390 214.1489 215.5012 242.2807 254.6258 270.7125 320.8267 350.1145 356.0164 393.5668 414.7879 462.3531 503.1913 532.7462 568.3419 642.4318 701.8235 703.0306 725.2023 741.0068 770.7884 853.8830 974.6965 1055.3223 1093.5277 1114.0200 1121.2973 1149.6260 1203.6216 1226.6563 1237.5655 1303.6084 1342.1494 1359.0092 1374.9448 1435.1606 1445.3022 1445.9980 1467.3610 1480.2879 1506.7849 1554.9233 1562.4709 1633.8853 1662.5306 2976.0107 3003.2234 3062.5518 3107.6479 3115.5386 3118.7466 3516.4632 3565.9279
redmass: 6.0984 4.2266 3.4143 6.2225 2.0946 9.4922 1.7183 2.0918 3.6583 1.5671 5.3829 7.2756 6.2235 4.4071 7.2118 5.8504 1.2575 6.8126 7.0914 3.4474 4.7170 5.8753 3.8605 6.4649 2.5384 4.1634 3.5002 2.2859 6.0740 1.2877 1.3004 1.7354 5.2248 8.0736 3.8453 7.2487 3.5139 2.0987 2.2690 1.2455 1.2332 1.0642 1.0824 1.1486 1.0439 2.0230 3.4751 8.7565 6.6800 1.0360 1.0356 1.1039 1.1003 1.0961 1.1014 1.0772 1.0753
irintensity: 1.5200 0.0010 0.4383 5.6006 0.3218 2.9178 5.1774 0.0343 0.6471 0.0032 0.3691 4.1224 5.7040 18.9603 4.8877 12.9204 81.7189 30.9888 2.8963 28.8079 0.3441 1.7397 7.9954 13.7189 124.4442 28.9529 6.0287 21.5439 10.2299 0.4078 0.0124 5.2431 2.9553 118.1497 65.1287 372.5563 33.6760 4.5732 38.6088 28.2711 61.2346 23.2327 3.7288 135.1320 21.9747 332.2071 264.6376 238.9798 558.7114 33.1811 56.6255 18.9321 23.1654 3.4586 9.4939 62.3616 63.3381
temp: 298.150 k
press: 1.00000 atm
elementType: 8 8 8 7 7 7 7 6 6 6 6 6 6 1 1 1 1 1 1 1 1
symmnumber: 1
zpe: 400534.3 jmol-1
zpe.correction: 0.152555 hartree
zpe.thermalcorrener: 0.165167 hartree
zpe.thermalcorrenthalpy: 0.166111 hartree
zpe.thermalcorrgfe: 0.112560 hartree
zpe.sumelectzpe: -677.102639 hartree
zpe.sumelectthermal: -677.090028 hartree
zpe.sumelectthermalent: -677.089084 hartree
zpe.sumelectthermalfe: -677.142634 hartree
dipole: -3.8993 8.2209 0.0316
dipole: 9.0988
quadrupole: -96.4317 -67.0473 -74.1653
quadrupole: 6.3352 0.0831 0.0612
quadrupole: -17.2169 12.1675 5.0494 6.3352 0.0831 0.0612
hfenergy: -677.2551944 hartree
pointgroup: C01 [X(C6H8N4O3)]
dipole: 1.1688663 -3.3795459 -0.1642542 debye
dipolederiv: -1.4144829 0.0050499 0.1578974 -0.0423059 -0.5654677 0.0055928 0.1586003 -0.0014022 -0.3948588 -0.450106 0.1351833 0.0204148 0.1361906 -1.1169422 -0.0289374 0.0208697 -0.0256175 -0.3380527 -0.8069166 0.1707283 0.0893721 0.7024408 -0.4395971 -0.0962698 0.0896137 -0.0262213 -0.1725829 -1.4268657 -0.1666966 0.1845527 -0.4266722 -0.8493915 0.0627327 0.1846034 0.02607 -0.2228073 -0.5078097 -0.2894412 0.0141077 -0.3276601 -1.22836 0.0523761 0.0150957 0.0472461 -0.4010301 -1.1233727 0.3876637 0.1191882 0.3723279 -0.7269816 -0.0587838 0.1213387 -0.0603255 -0.3691464 1.3106186 -0.2975348 -0.2014511 -0.5374165 0.0547173 0.0751226 -0.1998648 0.0470294 -0.127196 1.3156215 -0.1230477 -0.1599376 -0.0994612 1.6226973 0.0100043 -0.1605158 0.0170749 0.2702079 -1.1348712 0.3171548 0.1521556 -0.1283675 -0.8501134 0.0144704 0.1474713 -0.0513181 -0.0838773 1.8760528 0.1043079 -0.2382038 0.2762791 1.4297212 -0.0363505 -0.2409427 -0.0107172 0.3395441 0.0471026 -0.2069459 0.025825 -0.2091377 0.3311957 0.0317209 0.0262518 0.0330374 0.2196453 1.2765039 -0.1451243 -0.1519079 0.1241508 1.4732881 -0.0042659 -0.150586 0.0302298 0.3285571 0.3771733 0.178257 -0.0294166 0.0999142 0.3878676 -0.0184102 -0.0303459 -0.0327128 0.1787745 0.0486076 0.054694 0.0145348 -0.100475 0.2147106 0.0149723 0.0144068 -0.0085334 0.1444188 0.078708 -0.0485295 -0.0999271 0.0428701 -0.0424665 -0.0702798 -0.0545168 -0.0813449 -0.0218188 0.1138196 -0.0231119 0.05876 0.0612493 -0.0429079 0.0545196 0.0135372 0.0915263 -0.0556236 0.1654092 -0.0569207 0.0206029 0.0262344 0.2141663 -0.0039881 0.0209723 0.0056746 0.2857834 0.1392571 0.0528092 0.0301102 0.0182334 0.214503 -0.0035414 0.0307342 -0.0095043 0.333461 0.0384305 -0.057443 0.0233416 0.0299381 0.0745849 -0.0777419 0.0486105 -0.0212958 -0.0307627 0.0677567 0.0612966 0.0074185 -0.0677989 -0.2324645 0.0150522 0.0091879 -0.0037828 0.1240842 0.0093634 -0.0523491 -0.0374373 0.0494663 0.0772405 0.0620049 -0.0645214 0.0348873 -0.0067198 unknown
polarizability: 145.1617268|-8.8372012|134.0483363|-13.7869567|1.4516226|53.4869402 unknown
InChI: InChI=1S/C6H8N4O3/c1-7-4-3(9-13)5(11)8-6(12)10(4)2/h7-8H,1-2H3
charge 0 multiplicity 1
21 atoms
O  3.268685 0.352615 -0.39892
O  -0.620083 2.813049 0.208448
O  -2.965766 1.297058 0.511839
N  1.265543 -0.847698 -0.097672
N  -0.673062 -2.116534 0.193856
N  1.276761 1.523311 -0.090385
N  -2.25062 0.224525 0.409946
C  -0.126185 -0.865346 0.111877
C  -0.851091 0.367784 0.220077
C  2.023021 0.365322 -0.208835
C  2.046509 -2.098162 -0.216055
C  -0.139722 1.654413 0.125691
C  -2.077006 -2.522187 0.413046
H  3.094543 -1.802178 -0.371675
H  1.721153 -2.695048 -1.088438
H  1.988144 -2.698156 0.711158
H  -0.020971 -2.8933 0.087982
H  1.795171 2.404996 -0.163948
H  -2.467909 -2.122667 1.360966
H  -2.094785 -3.626648 0.432991
H  -2.734527 -2.14875 -0.386445
