program: Gaussian 09
title: 000255435
version: EM64L-G09RevD.01
frameworkgroup: C1[X(C11H16N6O5)]
method: RPBEPBE
basis: SDD
operation: Freq
keyword: #p
keyword: freq=noraman
keyword: PBEPBE/SDD
title: #p freq=noraman PBEPBE/SDD
converged: YES YES NO NO
title: Mulliken charges:
elementType: O O O O O N N N N N N C C C C C C C C C C C H H H H H H H H H H H H H H H H
charge: -0.264345 -0.467702 -0.455203 -0.476434 -0.482067 -0.183037 -0.083980 -0.278889 -0.108547 -0.617692 -0.597965 -0.097857 -0.184965 -0.191666 -0.090558 -0.085690 -0.369581 0.308170 -0.217883 -0.159872 0.190133 0.071079 0.262159 0.276506 0.271301 0.240324 0.257222 0.228186 0.204139 0.400230 0.352924 0.270297 0.367014 0.358647 0.347362 0.330214 0.345146 0.332879
chargesum: 0.00000
title: Mulliken charges with hydrogens summed into heavy atoms:
elementType: O O O O O N N N N N N C C C C C C C C C C C
charge: -0.264345 -0.067472 -0.102279 -0.109419 -0.123420 -0.183037 -0.083980 -0.278889 -0.108547 0.059884 0.080060 0.164302 0.091541 0.079636 0.149766 0.171532 0.062743 0.308170 0.052413 -0.159872 0.190133 0.071079
polarizability: 2.37621409e+02 -6.66601780e-01 1.91009491e+02 1.56537325e+01 -3.11605343e+00 1.14064387e+02
1716.lowfreq: -11.6999 -3.8088 -0.0006 -0.0005 0.0001 7.9256 26.5034 37.3953 50.3506
frequency: 26.1959 37.3513 50.3051 56.8077 89.3482 102.7541 118.8817 127.7907 152.0970 182.0163 214.2418 231.2647 246.2912 250.0620 259.4538 278.5781 289.4554 301.7866 323.7059 332.2171 343.4307 375.0696 408.8945 438.8740 468.8248 479.5074 481.9513 500.4973 505.0811 507.6323 521.8338 541.1568 551.3401 584.3599 616.8780 622.2115 637.6729 666.2648 695.1518 713.3579 761.4782 778.2812 800.9338 804.9235 841.6957 863.2033 872.1888 904.3405 918.8995 933.9068 937.0324 963.7916 988.9460 1000.6253 1020.2142 1028.9293 1039.7011 1045.8505 1058.3082 1064.9318 1082.4292 1135.3963 1152.3639 1170.5892 1181.0051 1193.8937 1205.9994 1213.5623 1236.0416 1244.9770 1259.7995 1273.3863 1286.3820 1297.3203 1298.4906 1324.9742 1335.0711 1340.1618 1355.0428 1382.6403 1390.5145 1402.2656 1408.9677 1441.9854 1462.3604 1468.2479 1502.2097 1569.9624 1576.5152 1607.4347 1614.5725 1636.8860 2652.3883 2962.7095 2987.5357 3016.4580 3027.9928 3046.1511 3054.7079 3064.9697 3233.3887 3507.0111 3542.1922 3554.9228 3574.1761 3596.3898 3697.0301 3712.6280
redmass: 6.4923 4.8966 4.9142 6.4305 5.5831 4.8941 5.2209 5.3720 4.7716 5.4595 5.3437 6.6721 5.6789 3.9930 1.2335 3.9337 4.6468 4.2773 1.8737 2.4932 4.2397 5.5198 4.2723 3.4258 4.6105 1.3293 3.5025 7.2837 1.1689 1.1502 1.1392 5.1248 1.0719 3.7617 5.3212 4.9587 4.4012 7.3276 6.2770 10.8165 6.0864 2.8196 5.3412 2.6008 8.3668 2.5647 4.2571 3.6303 2.8460 1.3891 2.4017 5.5313 4.4404 5.9650 3.5768 3.9900 2.6235 2.4888 1.9256 2.7896 2.7288 2.0631 1.2643 2.3300 1.1932 1.3013 1.7492 1.8281 1.2608 1.2012 4.0058 1.2580 1.1872 2.4251 1.6681 1.2360 1.3158 1.4588 5.0667 1.5032 1.8996 3.2195 1.7191 3.4665 1.0817 5.1360 2.7547 1.9349 2.0526 2.6250 1.3590 2.3480 1.0818 1.0607 1.0822 1.0869 1.0854 1.1036 1.0871 1.0879 1.0985 1.0650 1.0443 1.0451 1.0662 1.0669 1.1057 1.1057
irintensity: 1.1794 3.3219 4.4553 1.3725 1.3901 1.1954 5.3891 1.8862 6.0603 6.7429 7.1949 9.9230 15.8671 8.3054 119.3936 15.5781 13.5007 17.1527 64.7642 61.7051 40.9565 8.0839 1.3126 5.7855 15.3076 135.0653 38.3895 17.2508 66.7365 244.0406 184.3011 19.4310 10.0791 45.2707 1.7109 1.7470 41.8397 3.4211 38.1798 5.0689 24.3207 27.7771 71.0694 18.4517 13.4483 9.2072 34.6707 44.2815 10.1733 77.4155 100.8972 73.2120 133.1244 38.4464 11.9166 57.5609 31.9294 21.9014 44.2001 65.3872 3.7229 0.1875 23.7783 31.2756 15.7115 11.1792 41.7747 21.1697 7.9205 42.2454 70.1910 16.5428 1.5675 8.2400 22.7278 15.0759 12.2943 3.2567 94.0846 27.6236 49.4338 41.4228 9.8040 21.9747 9.6532 98.4192 77.1728 3.2561 91.9839 527.3548 349.5085 568.1448 1820.5206 38.9236 18.3072 37.4703 14.7583 33.7496 8.7823 25.1189 0.2623 28.1100 133.8792 118.9528 11.9450 6.8183 49.6911 61.6253
temp: 298.150 k
press: 1.00000 atm
elementType: 8 8 8 8 8 7 7 7 7 7 7 6 6 6 6 6 6 6 6 6 6 6 1 1 1 1 1 1 1 1 1 1 1 1 1 1 1 1
symmnumber: 1
zpe: 767050.8 jmol-1
zpe.correction: 0.292154 hartree
zpe.thermalcorrener: 0.312648 hartree
zpe.thermalcorrenthalpy: 0.313593 hartree
zpe.thermalcorrgfe: 0.242988 hartree
zpe.sumelectzpe: -1131.741351 hartree
zpe.sumelectthermal: -1131.720856 hartree
zpe.sumelectthermalent: -1131.719912 hartree
zpe.sumelectthermalfe: -1131.790517 hartree
dipole: -1.3017 -0.7777 -1.4966
dipole: 2.1305
quadrupole: -102.7410 -126.9078 -120.7287
quadrupole: -9.4119 -5.9085 0.9733
quadrupole: 14.0515 -10.1153 -3.9362 -9.4119 -5.9085 0.9733
hfenergy: -1132.0335049 hartree
pointgroup: C01 [X(C11H16N6O5)]
dipole: 0.5980409 0.4044544 0.4258389 debye
polarizability: 237.3040007|9.8002007|131.8517736|-5.6203493|-34.6433626|173.5395119 unknown
InChI: InChI=1S/C11H16N6O5/c12-8-4-9(16-11(13)15-8)17(2-14-4)10-6(21)5(20)7(22-10)3(19)1-18/h2-3,5-7,10,18-21H,1,12-13H2
charge 0 multiplicity 1
38 atoms
O  -1.137051 0.396926 1.050496
O  -1.120647 0.440124 -2.143848
O  -2.115821 -2.511783 -0.065298
O  -4.629387 0.434075 -0.266423
O  -5.263949 0.914695 2.345978
N  0.916832 -0.797874 0.77123
N  3.069316 -0.934837 1.573505
N  1.358379 0.55903 -1.268427
N  3.739084 1.111812 -1.533497
N  5.372786 0.413735 0.015192
N  2.136991 1.810323 -3.089898
C  -2.246554 0.645782 0.080033
C  -1.932148 -0.233501 -1.156584
C  -1.194608 -1.459667 -0.527972
C  -0.543183 -0.926043 0.780396
C  -3.586114 0.311527 0.763028
C  -3.891453 1.268722 1.919988
C  1.719048 -0.093295 -0.130993
C  1.789302 -1.270797 1.781504
C  3.038524 -0.19625 0.373153
C  4.064881 0.446378 -0.384115
C  2.421146 1.138698 -1.925137
H  -2.200054 1.713982 -0.192919
H  -2.868428 -0.528601 -1.660529
H  -0.451464 -1.869756 -1.238317
H  -0.796835 -1.622714 1.600798
H  -3.560099 -0.727799 1.150716
H  -3.160009 1.124984 2.737638
H  -3.856738 2.319194 1.561604
H  -0.14801 0.547024 -1.790414
H  -2.714506 -2.765226 -0.81233
H  1.417588 -1.847885 2.625531
H  -5.49182 0.49529 0.225923
H  -5.571881 1.532899 3.052785
H  5.623637 -0.07623 0.871345
H  6.078372 0.883951 -0.547157
H  1.179598 1.857062 -3.431241
H  2.899773 2.245845 -3.599941
