program: Gaussian 09
title: 000255413
version: EM64L-G09RevD.01
frameworkgroup: C1[X(C29H24N2O2)]
method: RPBEPBE
basis: SDD
operation: Freq
keyword: #p
keyword: freq=noraman
keyword: PBEPBE/SDD
title: #p freq=noraman PBEPBE/SDD
converged: YES YES NO NO
title: Mulliken charges:
elementType: O O N N C C C C C C C C C C C C C C C C C C C C C C C C C C C C C H H H H H H H H H H H H H H H H H H H H H H H H
charge: -0.302789 -0.330992 -0.310082 -0.334024 -0.528774 0.484904 0.507118 0.247195 -0.382659 -0.340971 -0.420785 -0.442297 -0.240295 -0.232800 -0.226493 -0.224867 0.321708 -0.242867 -0.244527 0.283306 0.202966 -0.474744 0.215707 -0.377879 -0.374427 -0.396926 -0.431589 -0.230542 -0.215573 -0.232885 -0.195450 -0.240520 -0.230535 0.197137 0.282905 0.252606 0.224816 0.224106 0.347137 0.224381 0.223945 0.224454 0.225220 0.227622 0.227453 0.391598 0.247107 0.257177 0.256260 0.247989 0.269233 0.229980 0.230584 0.230790 0.234561 0.233260 0.233069
chargesum: 0.00000
title: Mulliken charges with hydrogens summed into heavy atoms:
elementType: O O N N C C C C C C C C C C C C C C C C C C C C C C C C C C C C C
charge: -0.302789 -0.330992 0.037055 0.057574 -0.331638 0.484904 0.507118 0.247195 -0.099754 -0.088365 -0.195970 -0.218192 -0.015914 -0.008855 -0.002039 0.000353 0.321708 -0.015245 -0.017074 0.283306 0.202966 -0.227637 0.215707 -0.120702 -0.118167 -0.148937 -0.162357 -0.000562 0.015011 -0.002095 0.039111 -0.007260 0.002534
polarizability: 4.47640047e+02 2.37938937e+01 2.98844347e+02 -5.05703878e+00 2.36039904e+01 3.10578114e+02
1716.lowfreq: -8.6746 -6.6732 -3.2724 -0.0006 -0.0004 0.0004 3.3072 12.3377 21.6535
frequency: -6.5928 11.8462 21.6297 24.6748 26.8936 37.0517 39.8569 56.5983 58.7277 65.3274 79.9031 81.0245 107.0508 115.0033 131.4647 159.6646 194.4467 212.4186 224.7143 240.6022 251.6763 274.9183 281.5372 286.4610 306.8794 325.8307 333.8218 367.5741 400.0663 402.3855 405.8549 406.2617 456.8909 477.2254 487.8546 501.9056 542.2393 562.8124 572.1137 609.3512 614.3720 614.6918 615.0430 629.0205 632.1115 633.2453 651.9409 671.6493 694.8269 697.3261 700.7756 705.7919 708.3731 709.8631 727.7402 743.4292 755.0173 775.7516 779.0771 795.5673 829.5083 843.9586 853.4116 855.6698 859.8559 861.2553 879.7189 898.1057 911.7913 925.1679 932.8081 938.9698 946.9943 968.6232 980.9558 984.4245 984.6161 987.9803 988.7830 989.5545 990.2041 991.9828 996.3380 999.5675 1001.6868 1003.8216 1025.6712 1027.0060 1029.3371 1030.0898 1078.8461 1081.3777 1088.1466 1088.9293 1116.2624 1149.1037 1171.0997 1172.0346 1174.9308 1175.2908 1178.0463 1189.6556 1190.1274 1192.3382 1194.7426 1196.7541 1211.1173 1238.9133 1243.7256 1257.6629 1298.0635 1312.6275 1320.3689 1335.8188 1343.9952 1350.5790 1369.7684 1379.4677 1381.6890 1384.2302 1411.3752 1431.1009 1435.5656 1440.4226 1441.9339 1474.3110 1478.4268 1481.5211 1483.7195 1501.0490 1519.1484 1578.2985 1579.2548 1585.4884 1592.0643 1594.2976 1602.1358 1607.1524 1607.5047 1612.5111 1616.7100 2999.2158 3113.3123 3114.9747 3125.3945 3126.5111 3126.7355 3130.4814 3132.9857 3134.3565 3138.8409 3140.2593 3143.7004 3145.9750 3146.7327 3151.3715 3153.9908 3155.9665 3156.9499 3163.2549 3167.7475 3170.0386 3171.1104 3465.3567 3495.0090
redmass: 5.6137 6.1763 5.3332 6.3789 4.1739 4.1361 4.3864 4.6706 3.9318 5.1936 6.2392 5.2540 6.9072 6.5059 6.9509 6.4546 4.6807 4.2245 5.1704 4.4844 4.6771 5.2974 6.1149 5.7370 7.5614 6.8267 6.1404 6.7985 2.8305 2.7813 2.8771 2.8560 3.8518 3.4955 4.0016 3.8204 3.8909 5.7751 1.3923 5.9441 6.2094 6.3279 6.3200 4.6724 4.9183 1.3317 4.1637 4.2568 5.1055 2.2591 1.7234 1.9239 1.8242 1.9806 4.2267 2.8143 1.9066 2.1428 2.1454 3.0089 4.0778 1.2566 1.2569 3.5756 1.3043 1.2494 1.5564 3.0906 1.9040 1.7098 1.4504 1.6026 2.3088 1.3989 1.4503 1.4330 1.4145 5.3320 5.3687 5.0006 3.6269 1.5219 3.5771 1.3551 1.3467 1.3280 2.3555 2.2582 2.2437 2.0975 1.6354 1.6080 1.6278 1.6078 2.9238 2.3878 1.1356 1.0928 1.0543 1.0544 2.0907 1.2419 1.1174 1.8506 1.1200 1.1224 2.2814 1.6351 2.1908 1.9824 1.6621 1.4009 1.3587 1.2570 1.3368 1.9129 6.3020 6.3207 7.0542 7.2680 3.4712 2.2372 2.3498 2.1299 2.2006 2.3253 2.2096 2.2472 2.3803 5.6502 2.2888 6.1279 5.7917 7.2942 5.9135 5.9091 5.9384 6.0178 6.0828 6.0525 6.9964 1.0838 1.0872 1.0870 1.0867 1.0868 1.0848 1.0852 1.0877 1.0881 1.0923 1.0926 1.0906 1.0923 1.0899 1.0952 1.0961 1.0966 1.0970 1.1013 1.1016 1.0981 1.1017 1.0797 1.0802
irintensity: 0.1562 0.2437 0.3779 0.1177 0.0496 0.1016 1.0277 0.5851 0.1757 0.5107 0.8929 0.8793 4.1592 3.4305 2.2695 14.2190 3.3475 2.1468 9.5454 2.0229 0.9925 0.6962 0.9976 0.4975 1.7069 0.2230 9.2873 42.4545 0.8161 0.1671 0.1894 1.5485 9.1177 3.9330 0.7840 21.4728 4.2036 5.5130 72.2290 1.1675 3.4811 0.6373 0.8686 20.5688 34.6626 73.0931 4.6812 1.9966 6.5120 19.7885 66.9888 2.5489 81.7688 40.9211 33.4156 17.5974 35.1045 36.5435 50.4111 8.1395 2.2860 0.1307 1.2742 1.0175 0.4849 0.4909 18.5472 1.7375 1.2537 1.1035 0.9936 4.1204 2.0130 0.0866 1.6074 0.5647 0.0205 0.9731 0.8335 0.8847 2.9047 0.0374 5.3270 0.7710 0.6986 2.9719 3.1842 11.2147 18.1747 5.5501 0.8286 8.4729 10.0023 11.1738 28.7376 13.8532 0.3424 0.0940 0.0210 0.0253 5.4372 1.3019 0.3855 1.4696 5.8404 3.7580 10.2993 3.1179 10.1552 0.7839 22.7730 3.3830 8.1094 3.8054 9.6553 64.4507 5.4445 3.9912 15.8677 2.1092 845.3257 8.2776 51.9135 0.1888 21.5420 50.3439 39.9545 12.3081 6.1104 215.4494 61.9220 37.0989 2.2238 49.9683 2.7856 0.4557 39.6979 15.1592 0.7093 6.1946 107.4513 18.3016 7.8753 7.3444 1.8306 0.7709 3.5852 1.4828 1.2994 0.0734 20.9261 32.6957 24.2844 9.2335 0.4866 12.4394 30.0971 25.5081 36.6431 35.3435 31.1405 7.3967 16.6327 61.7266 112.7770
temp: 298.150 k
press: 1.00000 atm
elementType: 8 8 7 7 6 6 6 6 6 6 6 6 6 6 6 6 6 6 6 6 6 6 6 6 6 6 6 6 6 6 6 6 6 1 1 1 1 1 1 1 1 1 1 1 1 1 1 1 1 1 1 1 1 1 1 1 1
symmnumber: 1
zpe: 1180869.8 jmol-1
zpe.correction: 0.449770 hartree
zpe.thermalcorrener: 0.477288 hartree
zpe.thermalcorrenthalpy: 0.478232 hartree
zpe.thermalcorrgfe: 0.387536 hartree
zpe.sumelectzpe: -1377.153954 hartree
zpe.sumelectthermal: -1377.126435 hartree
zpe.sumelectthermalent: -1377.125491 hartree
zpe.sumelectthermalfe: -1377.216187 hartree
dipole: -1.9155 0.8813 1.8816
dipole: 2.8259
quadrupole: -164.6282 -181.2186 -186.7438
quadrupole: -0.0103 -10.3281 0.1471
quadrupole: 12.9020 -3.6884 -9.2136 -0.0103 -10.3281 0.1471
hfenergy: -1377.6037233 hartree
pointgroup: C01 [X(C29H24N2O2)]
dipole: 0.7132252 0.8124014 0.2596791 debye
polarizability: 440.8112793|16.7893268|313.9801576|-37.6750216|19.7175265|302.2710704 unknown
InChI: InChI=1S/C29H24N2O2/c32-27(21-26(22-13-5-1-6-14-22)23-15-7-2-8-16-23)30-31-29(33)28(24-17-9-3-10-18-24)25-19-11-4-12-20-25/h1-21,28,30-31H
charge 0 multiplicity 1
57 atoms
O  -1.462553 0.672233 0.478058
O  1.157961 -2.898169 -1.318112
N  -0.74869 -1.279812 -0.509278
N  0.584119 -0.861103 -0.433724
C  -3.166312 -1.039815 -0.164512
C  -4.043843 -0.214351 -1.125102
C  -3.803388 -1.202165 1.228584
C  -1.747133 -0.461946 -0.031435
C  -3.948431 1.196615 -1.23101
C  -4.126502 -0.076194 2.027127
C  -5.011576 -0.896108 -1.906861
C  -4.072078 -2.500219 1.728558
C  -4.804871 1.905105 -2.104134
C  -4.709107 -0.250943 3.301066
C  -5.869575 -0.187148 -2.775794
C  -4.659252 -2.675801 3.002713
C  3.650354 -0.267094 -0.440971
C  -5.769021 1.21967 -2.8776
C  -4.980334 -1.54963 3.793404
C  5.099689 -0.10256 -0.77042
C  3.021249 0.814284 0.386321
C  2.979916 -1.387703 -0.882125
C  1.547192 -1.756398 -0.869087
C  5.964187 0.605809 0.111887
C  3.04915 2.16574 -0.055629
C  5.654954 -0.64444 -1.965881
C  2.428748 0.519883 1.645332
C  7.338568 0.74245 -0.17567
C  2.470591 3.189533 0.725053
C  7.027495 -0.503383 -2.254529
C  1.858048 1.546833 2.429499
C  7.878272 0.18679 -1.358635
C  1.872047 2.883488 1.969768
H  -3.076204 -2.055646 -0.595929
H  -3.194825 1.730167 -0.642379
H  -3.911905 0.929867 1.654469
H  -5.098979 -1.987377 -1.830361
H  -3.823096 -3.379462 1.120489
H  -0.838974 -2.216346 -0.923132
H  -4.717142 2.995007 -2.179844
H  -4.953712 0.6265 3.910497
H  -6.61136 -0.73006 -3.37247
H  -4.864163 -3.686076 3.37458
H  -6.431761 1.77251 -3.552869
H  -5.436402 -1.681694 4.781071
H  0.7243 0.062457 -0.011378
H  3.557246 -2.178224 -1.375729
H  5.557431 1.034671 1.033832
H  3.5171 2.406247 -1.016645
H  5.001628 -1.14969 -2.685749
H  2.426364 -0.513771 2.009038
H  7.988206 1.28064 0.523332
H  2.485317 4.22307 0.362347
H  7.432352 -0.919862 -3.183535
H  1.397544 1.301328 3.392121
H  8.944429 0.297756 -1.585083
H  1.419432 3.677341 2.573565
