program: Gaussian 09
title: 000255410
version: EM64L-G09RevD.01
frameworkgroup: C1[X(C13H13N5)]
method: RPBEPBE
basis: SDD
operation: Freq
keyword: #pfreq=noraman
keyword: PBEPBE/SDD
title: #p freq=noraman PBEPBE/SDD
converged: YES YES NO NO
title: Mulliken charges:
elementType: N N N N N C C C C C C C C C C C C C H H H H H H H H H H H H H
charge: -0.166542 -0.452128 -0.010842 -0.043605 -0.112137 -0.017827 0.147118 0.235238 0.283829 0.266137 -0.422048 -0.322364 -0.609943 -0.385061 -0.853697 -0.242197 -0.355392 -0.250250 0.340373 0.255873 0.322167 0.246828 0.246815 0.263241 0.227811 0.229989 0.229304 0.249169 0.246028 0.226703 0.227410
chargesum: 0.00000
title: Mulliken charges with hydrogens summed into heavy atoms:
elementType: N N N N N C C C C C C C C C C C C C
charge: -0.166542 -0.111755 -0.010842 -0.043605 -0.112137 -0.017827 0.147118 0.235238 0.283829 0.266137 -0.166174 -0.000197 0.146940 -0.157250 -0.145236 -0.015494 -0.109363 -0.022840
polarizability: 3.09214967e+02 6.32763946e+00 1.88625703e+02 1.01589714e-01 -8.07830275e-03 7.73266844e+01
1716.lowfreq: -0.0006 -0.0003 0.0004 4.2916 9.1969 10.6566 34.8607 45.5460 90.2986
frequency: 34.3266 45.5220 90.2891 96.9875 112.9515 173.0718 176.0883 199.2962 202.1820 224.2910 247.2427 270.9564 285.7937 315.0463 408.7380 447.8144 483.6345 521.8649 531.7684 534.0296 544.0679 582.6349 612.7139 629.7993 643.4208 670.8375 730.0399 731.2662 743.9051 768.0883 784.7736 790.0644 820.0498 820.2506 880.4436 884.7597 932.3467 956.8242 957.0880 979.3820 1005.0806 1015.0383 1042.5313 1044.4405 1103.7684 1128.8548 1129.1309 1172.9718 1178.2874 1194.4035 1215.0017 1240.3713 1266.1554 1297.0700 1299.0037 1332.4691 1353.3393 1367.1655 1393.2700 1400.0250 1418.9060 1438.3524 1443.7767 1452.9566 1467.2785 1468.6521 1484.0983 1487.8230 1493.2793 1521.0548 1540.0389 1577.1445 1604.9002 1622.4240 2950.4591 3006.0321 3018.1517 3087.6923 3099.1733 3121.6254 3126.6835 3136.8354 3160.5205 3164.0078 3186.3673 3207.4434 3544.5913
redmass: 4.5448 4.4064 4.7140 1.3103 2.2687 3.3133 4.5711 1.0965 4.8638 4.4735 4.5102 3.5628 4.5968 4.4067 3.1204 3.0107 5.6696 5.7395 2.5310 6.2543 3.7906 6.6451 1.7086 4.3437 7.1430 5.7426 7.0061 2.9592 6.2551 1.3351 2.5575 5.9340 4.4221 2.2091 6.7253 1.2959 1.4397 2.9546 1.3613 1.5648 1.3010 4.3851 1.5247 2.1372 2.0808 2.8036 1.3133 1.1074 2.2056 2.1049 2.2499 4.1867 3.2452 1.5911 5.5021 4.4683 3.2236 3.4597 1.5064 1.7899 1.7708 2.3856 2.2811 2.0606 1.7033 1.0427 1.0448 1.2969 1.5754 3.0788 6.9339 5.3885 3.6174 4.5071 1.0403 1.0330 1.0979 1.0942 1.1026 1.0872 1.1017 1.0901 1.0983 1.0922 1.0956 1.0972 1.0750
irintensity: 0.0186 0.2618 0.1920 0.5602 1.3951 0.0030 0.4833 1.8560 4.6282 0.4073 9.7986 3.6177 0.6207 3.0274 1.6271 7.7170 0.1534 1.9694 12.9814 12.8025 6.0859 0.0925 25.8390 5.3290 21.0118 10.3482 33.6041 2.1946 2.0831 78.8016 47.4440 2.3622 2.9937 7.1277 15.0896 2.6799 10.9171 16.2708 3.0275 3.4902 2.3045 13.0250 6.8619 27.1912 6.9817 11.3127 1.0635 0.3511 26.0109 5.0551 7.2575 2.9587 37.7891 4.2533 79.4951 62.9228 14.5631 14.5693 25.2932 30.1227 12.4725 5.6918 177.8332 10.1586 19.8911 16.6792 15.4428 39.9240 186.6123 19.9272 422.9197 401.8594 234.5991 42.8400 29.0870 54.1498 22.7117 18.3900 17.7386 9.9822 3.0211 19.0840 30.0205 18.9373 21.3953 2.3319 44.4826
temp: 298.150 k
press: 1.00000 atm
elementType: 7 7 7 7 7 6 6 6 6 6 6 6 6 6 6 6 6 6 1 1 1 1 1 1 1 1 1 1 1 1 1
symmnumber: 1
zpe: 639244.3 jmol-1
zpe.correction: 0.243475 hartree
zpe.thermalcorrener: 0.258615 hartree
zpe.thermalcorrenthalpy: 0.259559 hartree
zpe.thermalcorrgfe: 0.200575 hartree
zpe.sumelectzpe: -775.673168 hartree
zpe.sumelectthermal: -775.658028 hartree
zpe.sumelectthermalent: -775.657084 hartree
zpe.sumelectthermalfe: -775.716068 hartree
dipole: -0.7526 2.1411 -0.0096
dipole: 2.2695
quadrupole: -93.3060 -101.3772 -109.8522
quadrupole: -5.7443 -0.0017 0.0964
quadrupole: 8.2058 0.1346 -8.3404 -5.7443 -0.0017 0.0964
hfenergy: -775.9166434 hartree
pointgroup: C01[X(C13H13N5)]
dipole: 0.28983 -0.8416602 -0.0698844 debye
polarizability: 309.2946138|5.51816|187.8908231|-0.9142994|8.4615504|77.9819176 unknown
InChI: InChI=1S/C13H13N5/c1-9-5-3-4-6-11(9)17-12-10-7-16-18(2)13(10)15-8-14-12/h3-8,17H,1-2H3
charge 0 multiplicity 1
31 atoms
N  -3.911682 -0.453363 -0.039136
N  0.783261 -0.47838 -0.058809
N  -3.521585 -1.79231 -0.150558
N  -2.834177 1.755134 0.138987
N  -0.380347 1.614578 0.11642
C  -1.653241 -0.439413 -0.046263
C  -2.818198 0.39021 0.026472
C  -0.391029 0.250146 0.00502
C  2.149402 -0.074442 -0.037662
C  3.130078 -1.117381 -0.117453
C  -2.157647 -1.777459 -0.155537
C  2.551741 1.283949 0.054927
C  -5.325125 -0.084199 -0.005184
C  4.495801 -0.755633 -0.102823
C  2.724492 -2.580247 -0.216244
C  3.924428 1.607723 0.066831
C  -1.581167 2.278734 0.17677
C  4.904788 0.594406 -0.011894
H  0.642232 -1.487027 -0.136449
H  -1.630593 -2.727504 -0.236964
H  1.780997 2.053486 0.115787
H  -5.827594 -0.409625 -0.931133
H  -5.822578 -0.553865 0.859545
H  -5.380649 1.011926 0.083296
H  5.250156 -1.54927 -0.163942
H  2.135688 -2.91453 0.662623
H  2.127467 -2.791947 -1.127238
H  3.616729 -3.225519 -0.265155
H  -1.511525 3.366937 0.26513
H  4.223525 2.659355 0.138596
H  5.970453 0.846831 -0.002758
