program: Gaussian 09
title: 000255391
version: EM64L-G09RevD.01
frameworkgroup: C1[X(C5H6FN3O)]
method: RPBEPBE
basis: SDD
operation: Freq
keyword: #p
keyword: freq=noraman
keyword: PBEPBE/SDD
title: #p freq=noraman PBEPBE/SDD
converged: NO YES NO YES
title: Mulliken charges:
elementType: F O N N N C C C C C H H H H H H
charge: -0.201274 -0.251676 -0.174906 -0.051099 -0.617456 -0.176443 0.169694 0.063454 0.132756 -0.618229 0.274200 0.293303 0.236643 0.236584 0.344681 0.339769
chargesum: 0.00000
title: Mulliken charges with hydrogens summed into heavy atoms:
elementType: F O N N N C C C C C
charge: -0.201274 -0.251676 -0.174906 -0.051099 0.066994 0.097757 0.169694 0.063454 0.132756 0.148301
polarizability: 1.19127960e+02 5.80202764e+00 8.47550051e+01 -1.92133077e-03 8.93815962e-03 3.76349046e+01
1716.lowfreq: -13.3784 -10.8346 -0.0011 -0.0004 0.0003 5.6906 78.0719 99.1405 167.5855
frequency: 78.0700 99.0788 167.5781 232.7437 257.4972 311.6245 324.5433 376.2040 405.5443 433.5409 500.3415 500.6424 574.2534 598.7865 635.7956 703.1659 730.2740 732.2111 809.6219 881.7043 986.7428 1015.8792 1110.3328 1122.9278 1173.4147 1222.7620 1291.0812 1334.0996 1422.5912 1465.0761 1496.5780 1502.9137 1513.7166 1594.4828 1636.0090 1664.2851 2990.4813 3082.1397 3118.8262 3174.9791 3541.8685 3697.8450
redmass: 3.9845 1.1638 4.5234 6.2815 5.3238 2.9764 5.6814 6.1231 3.3484 7.4797 1.1213 7.8542 1.1946 4.4190 8.5757 8.9547 6.8529 10.3052 4.1813 1.3896 3.3225 3.1036 1.7696 1.2965 3.0068 5.4276 1.5069 4.1460 1.3014 1.1300 1.0448 4.9735 3.6261 1.7873 3.7931 7.2518 1.0337 1.1033 1.0992 1.0951 1.0446 1.1054
irintensity: 9.9417 1.1273 1.8066 1.5075 6.1326 5.1265 1.3613 9.6227 12.0320 2.9999 175.9376 3.1789 122.6844 1.0310 17.9126 8.9965 7.2540 35.6874 4.5259 22.8916 77.1187 36.3276 18.7738 0.6090 21.0080 16.6267 13.4231 84.2314 125.3961 29.8677 19.5981 145.8812 155.5116 316.1155 195.6088 420.0393 60.7524 25.9666 0.2417 2.0598 125.8153 55.1833
temp: 298.150 k
press: 1.00000 atm
elementType: 9 8 7 7 7 6 6 6 6 6 1 1 1 1 1 1
symmnumber: 1
zpe: 302130.4 jmol-1
zpe.correction: 0.115075 hartree
zpe.thermalcorrener: 0.124315 hartree
zpe.thermalcorrenthalpy: 0.125259 hartree
zpe.thermalcorrgfe: 0.080789 hartree
zpe.sumelectzpe: -532.717307 hartree
zpe.sumelectthermal: -532.708067 hartree
zpe.sumelectthermalent: -532.707123 hartree
zpe.sumelectthermalfe: -532.751594 hartree
dipole: -2.6810 4.0310 0.0016
dipole: 4.8412
quadrupole: -51.0753 -59.9572 -58.2948
quadrupole: 17.4391 0.0043 -0.0027
quadrupole: 5.3671 -3.5147 -1.8524 17.4391 0.0043 -0.0027
hfenergy: -532.8323823 hartree
pointgroup: C01 [X(C5H6F1N3O1)]
dipole: -1.1374172 1.5277454 0.00063 debye
dipolederiv: -0.8409541 0.3527459 0.0000985 0.4520557 -0.4639277 -0.0000743 0.0000506 -0.0000254 -0.1186991 -1.2058087 0.4110837 -0.0000307 0.3748173 -0.6983478 0.0000161 0.0005867 -0.0003068 -0.3868128 -0.9827678 -0.3359732 -0.0000859 0.5918079 -0.6181889 -0.0002082 0.0003521 0.0002318 -0.1529026 -1.4756615 0.112761 0.0001279 0.041554 -0.4785317 0.0000765 -0.0000001 -0.000049 -0.3047722 -1.2886953 -0.466995 -0.0000509 -0.6411158 -0.4758727 0.0000654 -0.0001146 0.0000697 -0.7104022 0.7800631 0.3088949 0.0000386 -0.2691223 0.0361548 0.0000444 -0.0001244 -0.0000295 -0.0135672 0.4282132 -0.5374989 -0.0001193 -0.929435 -0.1330827 -0.0000057 -0.0000216 -0.0000665 -0.0221465 1.7769842 -0.4560316 -0.0000836 -0.4227948 1.2137957 0.0000922 -0.0004701 0.0003321 0.237778 1.6483365 0.3037138 -0.0000049 0.6160215 0.9931303 0.0000565 -0.000047 0.0000729 0.254221 0.4018098 0.308905 0.0002809 0.1383924 0.105318 -0.0000452 0.0000496 -0.0001775 0.228251 0.1074099 -0.0035762 0.0000124 0.019438 -0.007939 -0.0000176 -0.0000402 -0.0000217 0.1830684 0.0821023 0.0093842 0.0000672 0.1644449 0.1334313 -0.0001861 0.0000845 -0.000094 0.1349432 0.0389197 -0.0464619 0.0269651 -0.1116322 -0.0086655 -0.1020943 -0.0466345 -0.1236721 -0.0575168 0.0390986 -0.0461719 -0.0272436 -0.1115317 -0.0090653 0.1023417 0.0462883 0.1237835 -0.0569983 0.1977028 0.0379737 0.0000172 0.092219 0.2461238 -0.0000245 0.0000211 -0.0000334 0.3878699 0.2932473 0.0472466 0.0000112 -0.005119 0.1656674 -0.0000369 0.0000197 -0.0000142 0.3976863 unknown
polarizability: 118.4165063|7.5902644|85.4664585|-0.0023928|0.0088236|37.6349046 unknown
InChI: InChI=1S/C5H6FN3O/c1-9-2-3(6)4(7)8-5(9)10/h2H,7H2,1H3
charge 0 multiplicity 1
16 atoms
F  -2.39496 1.485066 -0.000142
O  2.274911 -1.421122 -0.001153
N  1.201441 0.675075 -0.000417
N  -0.076038 -1.401892 -0.000642
N  -2.419465 -1.338944 -0.000547
C  0.03186 1.405779 -0.000292
C  -1.180504 0.757894 -0.000263
C  1.178021 -0.798556 -0.000347
C  -1.21447 -0.684278 -0.00049
C  2.51331 1.356239 -0.000378
H  0.099306 2.497086 -0.000211
H  3.279677 0.565914 -0.001613
H  2.631278 1.979936 0.903163
H  2.630227 1.981971 -0.902635
H  -2.411024 -2.35732 -0.000718
H  -3.296474 -0.823749 -0.000416
