program: Gaussian 09
title: 000255384
version: EM64L-G09RevD.01
frameworkgroup: C1[X(C18H18Cl2FN3O2)]
method: RPBEPBE
basis: SDD
operation: Freq
keyword: #p
keyword: freq=noraman
keyword: PBEPBE/SDD
title: #p freq=noraman PBEPBE/SDD
converged: YES YES NO NO
title: Mulliken charges:
elementType: Cl Cl F O O N N N C C C C C C C C C C C C C C C C C C H H H H H H H H H H H H H H H H H H
charge: -0.048758 -0.047654 -0.199875 -0.204825 -0.213406 -0.170621 -0.069698 0.011502 0.479960 -0.390814 -0.388800 -0.591805 0.339562 -0.376702 0.321800 -0.418209 -0.585685 -0.586259 -0.835233 -0.379656 0.165994 0.289992 -0.296853 -0.501492 -0.365965 0.350287 0.253597 0.252801 0.254930 0.251885 0.237930 0.238400 0.273839 0.296450 0.270720 0.293964 0.269584 0.232775 0.259205 0.232480 0.268179 0.261095 0.301959 0.263423
chargesum: 0.00000
title: Mulliken charges with hydrogens summed into heavy atoms:
elementType: Cl Cl F O O N N N C C C C C C C C C C C C C C C C C C
charge: -0.048758 -0.047654 -0.199875 -0.204825 -0.213406 -0.170621 -0.069698 0.011502 0.479960 0.115583 0.118015 -0.353875 0.339562 -0.138302 0.321800 -0.144370 -0.018515 -0.022712 -0.110773 -0.111477 0.165994 0.289992 -0.035758 -0.199534 -0.102542 0.350287
polarizability: 5.13181171e+02 -1.48312536e+01 2.51100557e+02 -3.70846213e+00 -4.50304647e+00 1.61211564e+02
1716.lowfreq: -4.5132 -1.9263 0.0012 0.0016 0.0023 2.7132 13.8485 17.7111 23.7422
frequency: 13.7409 17.7038 23.7334 28.8837 41.0868 44.4104 47.1891 59.4431 89.9808 95.3248 119.0500 126.7513 144.7296 164.4636 166.3129 191.6322 201.8430 206.9771 215.4219 220.4014 242.5989 244.1091 261.8702 303.6700 333.5701 362.4035 376.7545 387.9043 400.9670 409.2882 433.8428 454.3795 471.3322 496.5206 521.3175 540.4594 553.5724 564.6180 591.7999 600.3161 654.6472 668.3320 675.5139 701.1628 706.5836 729.8833 733.2891 742.9366 774.8710 783.6863 791.0422 813.9605 825.2787 829.6241 859.7838 884.8351 886.4928 909.9230 950.2992 962.0076 962.6593 986.6388 1000.4665 1009.4217 1035.2965 1037.0417 1045.6209 1051.5631 1053.5257 1104.5286 1120.4759 1127.8550 1167.8148 1172.7522 1187.1876 1206.1592 1212.3109 1219.3512 1245.9549 1257.1883 1258.0260 1270.7764 1286.8898 1293.6183 1303.8152 1343.1433 1348.7013 1351.9745 1355.2596 1363.6128 1386.4350 1398.8363 1404.7323 1421.0084 1445.1234 1458.8203 1461.1853 1471.2409 1473.7854 1486.3468 1490.3087 1506.6371 1519.1340 1557.2916 1560.4566 1605.3241 1617.9608 1644.4410 2980.9562 3019.4837 3024.3672 3060.6431 3062.8653 3064.2779 3068.0362 3075.4639 3080.5811 3089.2101 3144.6877 3147.3003 3148.1291 3151.1500 3161.6186 3167.6843 3183.0988 3191.7795
redmass: 11.1128 9.3852 12.1046 11.8077 7.9601 8.9124 4.7857 10.3306 3.4798 5.5522 2.7541 3.3944 5.6379 1.1155 8.0361 4.6912 3.4175 5.7439 4.8467 5.3194 4.0488 6.2069 3.7599 5.6557 4.6596 6.7493 3.7089 5.9241 4.3885 4.4390 5.9277 4.1603 3.7053 4.0947 5.4625 3.8230 4.3168 4.2674 3.8564 4.1766 7.7297 7.2319 6.3224 5.2719 4.7474 5.1907 5.6547 3.8790 3.8915 1.1549 1.2618 1.9589 1.4254 2.5814 1.4877 1.5161 4.8661 6.3644 1.3412 1.5060 2.1884 1.3880 1.4338 1.5458 3.8930 3.8301 1.5690 1.6058 2.4930 2.5025 1.4729 1.4096 2.2612 1.5739 4.3376 3.2848 2.3269 2.1581 1.5534 1.1759 1.1650 1.4218 1.6959 1.1833 1.4919 4.6791 6.6947 1.3180 1.3889 3.0649 1.8004 1.5164 2.1299 3.5350 2.5790 1.0969 1.1127 2.3135 1.0892 1.1537 1.2942 1.1553 2.7166 7.0907 7.9798 6.8356 6.8346 8.0385 1.0378 1.0601 1.0608 1.0974 1.0571 1.0573 1.0893 1.1037 1.1041 1.0985 1.0887 1.1101 1.1101 1.0919 1.0885 1.0956 1.0977 1.0928
irintensity: 0.8377 0.7564 0.5408 0.5599 1.0711 1.8458 0.0582 0.3101 0.9148 1.7342 1.8295 1.4158 1.2677 2.1385 2.5088 2.5787 5.0879 4.3315 4.2584 0.2742 12.7693 1.9420 4.4394 4.5013 2.7175 8.2137 5.2870 2.1546 11.4131 3.8034 3.1205 8.8498 4.6382 19.7929 12.5644 7.0845 19.8263 4.9058 5.9313 0.7894 5.2150 98.2244 0.9409 67.5209 31.0472 28.2395 22.8268 7.8975 24.6469 3.1852 1.4692 58.0139 38.2176 103.4591 21.7174 32.1761 1.2152 21.0228 2.6512 33.3045 41.9305 10.4754 4.2279 4.9389 0.4951 0.2009 6.0303 0.2021 7.4764 189.4073 50.8692 13.0476 120.1052 81.1401 117.4898 121.6279 106.7876 22.3121 45.4317 40.8555 17.7132 36.3711 162.4846 7.6627 90.9068 45.7310 101.2550 52.2314 111.3307 21.3541 96.5523 90.6363 46.1504 92.3405 36.2839 21.6508 7.9538 152.5084 22.6525 44.3868 10.9014 1.0646 298.3689 13.4408 64.8448 1610.3183 124.2489 105.2303 17.3423 20.1342 27.2681 10.6259 12.6969 16.5814 20.1866 8.0547 6.3820 19.4707 6.3023 2.2704 23.0781 22.0226 2.8884 21.0178 2.4981 8.5216
temp: 298.150 k
press: 1.00000 atm
elementType: 17 17 9 8 8 7 7 7 6 6 6 6 6 6 6 6 6 6 6 6 6 6 6 6 6 6 1 1 1 1 1 1 1 1 1 1 1 1 1 1 1 1 1 1
symmnumber: 1
zpe: 865884.3 jmol-1
zpe.correction: 0.329798 hartree
zpe.thermalcorrener: 0.355459 hartree
zpe.thermalcorrenthalpy: 0.356403 hartree
zpe.thermalcorrgfe: 0.269011 hartree
zpe.sumelectzpe: -2029.390672 hartree
zpe.sumelectthermal: -2029.365011 hartree
zpe.sumelectthermalent: -2029.364067 hartree
zpe.sumelectthermalfe: -2029.451459 hartree
dipole: 4.1778 1.7416 -3.5831
dipole: 5.7728
quadrupole: -190.5519 -178.6216 -166.7967
quadrupole: -8.2487 12.7282 3.4055
quadrupole: -11.8952 0.0352 11.8600 -8.2487 12.7282 3.4055
hfenergy: -2029.7204701 hartree
pointgroup: C01 [X(C18H18Cl2F1N3O2)]
dipole: 1.6494649 0.5960366 -1.4430384 debye
polarizability: 513.281367|-14.2563731|250.0457987|-0.8946292|-10.4153778|162.1661267 unknown
InChI: InChI=1S/C18H18Cl2FN3O2/c1-13-10-16(23(8-6-19)9-7-20)4-2-14(13)12-22-17-5-3-15(21)11-18(17)24(25)26/h2-5,10-12H,6-9H2,1H3
charge 0 multiplicity 1
44 atoms
Cl 6.831623 -3.205134 0.195673
Cl 5.991616 4.090365 0.324316
F  -7.605236 1.056644 -0.31834
O  -4.445372 -1.790613 2.286237
O  -2.664961 -2.063495 0.891087
N  4.506649 0.227014 0.024343
N  -1.995709 0.513516 -0.342702
N  -3.755524 -1.456652 1.243788
C  3.121209 0.067201 -0.157035
C  5.464477 -0.826476 -0.362152
C  5.071323 1.460084 0.606178
C  2.576369 -1.150933 -0.672178
C  1.193838 -1.335776 -0.869911
C  2.204772 1.119119 0.171686
C  0.293018 -0.271628 -0.536266
C  0.831736 0.937951 -0.012464
C  5.619992 -1.870984 0.759966
C  5.261288 2.543003 -0.473393
C  0.697512 -2.669572 -1.407233
C  -1.150586 -0.423018 -0.705177
C  -3.389509 0.481099 -0.381749
C  -4.25867 -0.355004 0.405259
C  -4.029682 1.517671 -1.138113
C  -5.660918 -0.144392 0.45718
C  -5.418327 1.700656 -1.144977
C  -6.212195 0.860948 -0.333195
H  5.149953 -1.320853 -1.297661
H  6.44669 -0.36429 -0.564081
H  4.430171 1.842864 1.418802
H  6.050571 1.22788 1.060076
H  3.237633 -1.986762 -0.91946
H  2.561653 2.074247 0.566392
H  0.129898 1.739258 0.241463
H  4.678341 -2.391028 0.985853
H  6.050291 -1.439977 1.676098
H  4.310825 2.855562 -0.92874
H  5.977724 2.236005 -1.249783
H  1.537166 -3.367336 -1.561984
H  -0.014761 -3.148168 -0.710364
H  0.179571 -2.553656 -2.377894
H  -1.507259 -1.353553 -1.172029
H  -3.381213 2.183393 -1.714661
H  -6.280599 -0.772249 1.101705
H  -5.887489 2.48477 -1.745961
