program: Gaussian 09
title: 000255364
version: EM64L-G09RevD.01
frameworkgroup: C1[X(C10H12N2O2S)]
method: RPBEPBE
basis: SDD
operation: Freq
keyword: #p
keyword: freq=noraman
keyword: PBEPBE/SDD
title: #p freq=noraman PBEPBE/SDD
converged: YES YES NO NO
title: Mulliken charges:
elementType: S O O N N C C C C C C C C C C H H H H H H H H H H H H
charge: 0.301119 -0.184614 -0.184649 -0.222594 0.071375 0.285979 -0.511794 -0.511793 -0.708912 -0.721507 0.175952 0.175720 -0.156975 -0.477155 -0.183006 0.255279 0.244689 0.244586 0.255279 0.228257 0.218919 0.219018 0.221729 0.213364 0.221790 0.268895 0.261050
chargesum: 0.00000
title: Mulliken charges with hydrogens summed into heavy atoms:
elementType: S O O N N C C C C C C C C C C
charge: 0.301119 -0.184614 -0.184649 -0.222594 0.071375 0.285979 -0.011826 -0.011928 -0.042718 -0.064624 0.175952 0.175720 -0.156975 -0.208260 0.078045
polarizability: 1.75965411e+02 -5.74394924e-03 1.13926099e+02 1.91348911e+00 -7.78283934e-02 1.18330264e+02
1716.lowfreq: -16.3857 -7.5431 -5.9579 0.0022 0.0024 0.0030 31.1643 45.2293 72.4683
frequency: 30.7562 45.2100 72.4478 78.7950 115.8346 147.3764 185.1571 223.9645 226.2980 258.6747 285.3173 328.3552 342.5950 357.8580 389.1323 432.8030 446.1468 500.6730 536.2031 545.5754 572.4459 588.8371 593.8654 638.2654 642.8662 694.9046 739.6726 799.9419 835.7837 871.9992 874.8006 887.1790 927.3477 929.2754 941.9125 986.5615 1008.5329 1026.2542 1036.8705 1093.1581 1122.9571 1133.3986 1167.4151 1211.5496 1212.6081 1267.2359 1280.0371 1284.4877 1287.6631 1306.4892 1329.2703 1385.6959 1405.3597 1431.4035 1441.5737 1446.0486 1462.9456 1471.3544 1484.6518 1485.8155 1504.9244 1613.3120 1651.3966 2972.1494 2977.2128 2978.1868 2982.7302 3067.0755 3068.2189 3072.1310 3072.2788 3074.6198 3079.6127 3205.7600 3249.4107
redmass: 6.1187 5.4522 4.1827 5.6991 8.9670 4.1100 1.0435 7.5229 1.2783 1.6168 7.2089 2.9190 2.6044 2.6876 5.7147 3.2365 4.4125 5.1676 6.4641 4.7679 3.6018 6.3927 3.8105 4.7636 6.8809 7.5979 1.2587 3.2392 5.7962 6.5566 1.3436 1.7625 2.3298 1.7905 1.4379 2.0063 1.5198 3.9975 1.9858 1.8729 2.0406 1.6711 2.2284 2.8782 2.3187 2.8274 1.3775 2.7022 1.8396 2.7920 1.8569 1.2017 1.1970 1.0739 1.0812 5.6387 1.0473 1.0556 1.0601 1.0611 8.7268 11.7635 11.7489 1.0359 1.0435 1.0647 1.0583 1.0995 1.0952 1.0973 1.0997 1.0975 1.0986 1.0918 1.1018
irintensity: 0.1594 3.0679 0.0522 5.3377 3.2170 3.3343 0.1710 2.4548 0.7445 1.0812 0.0885 2.6433 0.1704 4.4189 3.7509 1.4648 7.4085 0.4211 8.2625 31.4827 11.3674 4.3816 24.7554 13.3537 7.2542 3.4145 77.3798 1.5244 9.4720 34.4518 1.2342 0.2673 9.5406 0.0513 1.2198 5.0206 1.4197 0.1022 43.2140 30.6329 150.9335 10.5444 6.9386 29.6012 171.5896 30.8766 7.3229 105.0606 11.9776 133.0100 20.8597 19.3557 18.1719 6.8967 6.8194 6.1557 1.0622 10.7414 6.4540 12.8049 58.7649 351.9837 59.7960 32.7600 28.4437 6.0225 2.5647 16.3771 1.6149 7.8883 5.8660 56.2346 52.5131 3.8515 0.9092
temp: 298.150 k
press: 1.00000 atm
elementType: 16 8 8 7 7 6 6 6 6 6 6 6 6 6 6 1 1 1 1 1 1 1 1 1 1 1 1
symmnumber: 1
zpe: 540871.3 jmol-1
zpe.correction: 0.206007 hartree
zpe.thermalcorrener: 0.220468 hartree
zpe.thermalcorrenthalpy: 0.221412 hartree
zpe.thermalcorrgfe: 0.163794 hartree
zpe.sumelectzpe: -1045.164944 hartree
zpe.sumelectthermal: -1045.150484 hartree
zpe.sumelectthermalent: -1045.149539 hartree
zpe.sumelectthermalfe: -1045.207158 hartree
dipole: -2.9053 -0.0024 0.9006
dipole: 3.0417
quadrupole: -70.3883 -111.3004 -94.5356
quadrupole: -0.0136 3.2904 -0.0345
quadrupole: 21.6864 -19.2256 -2.4608 -0.0136 3.2904 -0.0345
hfenergy: -1045.3709513 hartree
pointgroup: C01 [X(C10H12N2O2S1)]
dipole: -1.159999 -0.0826696 0.2822293 debye
polarizability: 175.5934362|-0.3246846|114.1880018|4.9914066|-1.0633539|118.4403358 unknown
InChI: InChI=1S/C10H12N2O2S/c1-10(2)5-7(13)12(8(14)6-10)9-11-3-4-15-9/h3-4H,5-6H2,1-2H3
charge 0 multiplicity 1
27 atoms
S  2.403149 -0.315825 1.601022
O  0.147427 2.320026 0.480624
O  0.209156 -2.226926 -0.59073
N  0.177602 0.062398 -0.122252
N  2.435422 0.30185 -0.994828
C  -2.706757 -0.039104 0.139868
C  -2.002221 1.317065 -0.125931
C  -1.968747 -1.11356 -0.701285
C  -2.650625 -0.395361 1.649009
C  -4.182896 0.048113 -0.31607
C  -0.499964 1.310446 0.11697
C  -0.465988 -1.177903 -0.470239
C  1.601267 0.055176 -0.006046
C  3.96509 -0.094493 0.760346
C  3.767037 0.220544 -0.574844
H  -2.422862 2.12317 0.499845
H  -2.158623 1.61683 -1.183125
H  -2.122912 -0.910802 -1.781671
H  -2.364716 -2.125303 -0.506613
H  -1.613121 -0.469978 2.024104
H  -3.169837 0.374002 2.249216
H  -3.145611 -1.365357 1.838258
H  -4.725922 0.823462 0.255375
H  -4.260989 0.299692 -1.390653
H  -4.702594 -0.914399 -0.154155
H  4.90215 -0.210106 1.300508
H  4.560387 0.40434 -1.2994
