program: Gaussian 09
title: 000255356
version: EM64L-G09RevD.01
frameworkgroup: C1[X(C15H9NO4)]
method: RPBEPBE
basis: SDD
operation: Freq
keyword: #p
keyword: freq=noraman
keyword: PBEPBE/SDD
title: #p freq=noraman PBEPBE/SDD
converged: YES YES NO NO
title: Mulliken charges:
elementType: O O O O N C C C C C C C C C C C C C C C H H H H H H H H H
charge: -0.422695 -0.231127 -0.185980 -0.202285 0.020433 0.257126 0.185332 0.175462 0.460328 0.196626 -0.659107 0.263090 -0.403567 -0.338671 -0.441463 -0.390560 -0.247555 -0.248575 -0.243167 0.075763 0.278759 0.235088 0.224670 0.254567 0.282285 0.243439 0.235140 0.238494 0.388150
chargesum: 0.00000
title: Mulliken charges with hydrogens summed into heavy atoms:
elementType: O O O O N C C C C C C C C C C C C C C C
charge: -0.034545 -0.231127 -0.185980 -0.202285 0.020433 0.257126 0.185332 0.175462 0.460328 0.196626 -0.380348 0.263090 -0.168480 -0.114001 -0.186896 -0.108275 -0.004116 -0.013435 -0.004674 0.075763
polarizability: 3.00135287e+02 -1.33558351e+01 2.15689893e+02 8.22023073e+00 -1.23941996e+01 8.11030032e+01
1716.lowfreq: -4.9203 -1.7555 -0.0010 -0.0005 -0.0004 6.0833 43.4204 66.4156 73.3183
frequency: 43.4132 66.4147 73.3166 100.7124 111.9883 155.2015 179.3571 188.4749 229.6001 256.8879 266.4889 318.3959 335.6717 355.2876 399.0652 430.0088 438.9653 485.5929 503.2021 512.8602 560.2700 566.4413 588.8246 599.9593 622.2814 636.1333 651.5796 686.2599 701.0035 726.6388 755.8719 764.6786 767.1532 777.7459 830.3906 834.8696 873.0701 879.1937 931.5124 940.8705 948.3022 971.7226 987.7711 998.1524 1022.8594 1048.7525 1070.7192 1103.6110 1120.2183 1164.1174 1180.8411 1204.0551 1210.4905 1217.0537 1253.1154 1269.3544 1308.6485 1328.6696 1363.1229 1373.3338 1392.3182 1408.0767 1428.6010 1443.1790 1446.4637 1494.1368 1531.2870 1575.0408 1593.5207 1609.2164 1623.6980 1637.7126 3131.7486 3140.7252 3151.9383 3158.3069 3160.2248 3169.9873 3176.1723 3186.1081 3525.2038
redmass: 7.9292 12.9239 4.4468 10.4982 5.2608 6.3983 5.2510 12.8340 5.5275 5.4986 5.6251 6.6088 8.5406 5.7689 5.7842 3.8039 5.7238 4.9059 3.3556 4.7195 2.4626 5.5022 2.9034 4.4407 2.4628 5.0166 5.2164 6.6893 4.8910 7.1144 2.9523 2.2109 3.4897 1.6087 3.3351 3.2901 5.8429 1.6012 1.4383 2.5483 2.5419 1.4891 1.3830 1.3614 5.0991 2.4103 2.8799 1.7865 2.2615 1.5380 1.0789 1.6953 1.8401 3.4904 2.0384 1.7089 2.6873 2.3170 3.5605 10.6523 4.6393 4.5314 3.0257 2.5887 3.3222 3.5053 4.2327 7.5538 6.5054 6.9045 6.4356 8.7032 1.0864 1.0893 1.0888 1.0930 1.0920 1.0990 1.0926 1.0979 1.0641
irintensity: 1.8508 1.7342 0.0711 3.7675 3.1193 0.2485 0.9865 0.5426 0.9531 1.0231 3.3454 0.3242 3.5353 2.2125 0.1739 0.2298 8.3133 11.5322 2.2823 5.2358 21.0985 31.0622 34.8801 13.3066 63.1238 9.2362 27.4274 32.3132 0.7284 23.2121 2.0374 21.4714 15.8300 97.6726 8.5581 9.3046 0.9299 1.0308 2.2860 67.6326 31.6159 10.0443 2.5003 0.4366 3.1177 3.2526 140.5858 184.4021 0.1691 0.5302 2.2135 1.3739 65.2481 164.8091 13.5231 1.5005 5.8587 62.6089 7.7075 150.2486 5.0439 1.6205 26.5301 12.3064 7.5418 22.6304 7.7550 9.2449 8.0563 9.1573 8.8752 232.6696 1.1899 4.5481 12.6840 7.0680 0.9839 21.5983 17.0817 9.9048 55.0615
temp: 298.150 k
press: 1.00000 atm
elementType: 8 8 8 8 7 6 6 6 6 6 6 6 6 6 6 6 6 6 6 6 1 1 1 1 1 1 1 1 1
symmnumber: 1
zpe: 539959.8 jmol-1
zpe.correction: 0.205660 hartree
zpe.thermalcorrener: 0.220966 hartree
zpe.thermalcorrenthalpy: 0.221910 hartree
zpe.thermalcorrgfe: 0.162933 hartree
zpe.sumelectzpe: -931.220354 hartree
zpe.sumelectthermal: -931.205049 hartree
zpe.sumelectthermalent: -931.204104 hartree
zpe.sumelectthermalfe: -931.263081 hartree
dipole: 6.6655 1.5604 -0.2909
dipole: 6.8519
quadrupole: -116.0022 -88.4755 -122.7807
quadrupole: -0.1681 0.0602 1.0246
quadrupole: -6.9161 20.6106 -13.6946 -0.1681 0.0602 1.0246
hfenergy: -931.4260143 hartree
pointgroup: C01 [X(C15H9N1O4)]
dipole: -2.635237 -0.5379699 -0.182153 debye
polarizability: 299.5818604|-15.204019|214.1957953|-6.268511|21.1671696|83.1505276 unknown
InChI: InChI=1S/C15H9NO4/c17-15(18)12-8-9-4-1-2-5-10(9)11-6-3-7-13(14(11)12)16(19)20/h1-8,17H
charge 0 multiplicity 1
29 atoms
O  1.543302 3.236713 0.366405
O  2.577746 1.714802 -1.045309
O  4.20233 -0.960632 0.13781
O  3.003357 0.45879 1.454901
N  3.089558 -0.473421 0.56266
C  -0.624572 -1.131808 -0.112401
C  0.58924 -0.353905 0.015157
C  -1.933185 -0.473655 -0.013111
C  -1.981993 0.949363 0.198405
C  0.485336 1.100009 0.061971
C  -0.758269 1.702666 0.192824
C  1.824115 -1.08637 0.07946
C  -0.527276 -2.541275 -0.324302
C  -3.17271 -1.179416 -0.086263
C  -3.238952 1.613977 0.342211
C  1.898888 -2.465016 -0.159534
C  0.7087 -3.19378 -0.392144
C  -4.397795 -0.512303 0.059213
C  -4.436762 0.89454 0.278868
C  1.648413 1.984052 -0.248002
H  -0.809934 2.794585 0.245699
H  -1.437469 -3.134979 -0.438816
H  -3.187132 -2.260609 -0.248984
H  -3.247936 2.698541 0.498968
H  2.8745 -2.956481 -0.122735
H  0.757218 -4.271063 -0.576158
H  -5.333336 -1.079341 0.005403
H  -5.39851 1.405324 0.391893
H  2.324226 3.788794 0.09161
