program: Gaussian 09
title: 000255311
version: EM64L-G09RevD.01
frameworkgroup: C1[X(C14H10N4O4)]
method: RPBEPBE
basis: SDD
operation: Freq
keyword: #p
keyword: freq=noraman
keyword: PBEPBE/SDD
title: #p freq=noraman PBEPBE/SDD
converged: NO YES NO NO
title: Mulliken charges:
elementType: O O O O N N N N C C C C C C C C C C C C C C H H H H H H H H H H
charge: -0.199784 -0.199805 -0.201595 -0.201616 0.022674 0.022626 -0.081748 -0.081749 0.454161 0.454154 0.382737 0.382861 -0.488124 -0.488154 -0.364167 -0.364162 -0.351894 -0.351926 -0.182309 -0.182304 -0.352036 -0.352031 0.289216 0.289213 0.283187 0.283192 0.291809 0.291806 0.245718 0.245721 0.252164 0.252164
chargesum: 0.00000
title: Mulliken charges with hydrogens summed into heavy atoms:
elementType: O O O O N N N N C C C C C C C C C C C C C C
charge: -0.199784 -0.199805 -0.201595 -0.201616 0.022674 0.022626 -0.081748 -0.081749 0.454161 0.454154 0.382737 0.382861 -0.198908 -0.198941 -0.080980 -0.080970 -0.060085 -0.060120 0.063408 0.063417 -0.099872 -0.099866
polarizability: 5.06508257e+02 8.87510647e+00 2.10111392e+02 -1.65211244e-03 3.26047779e-04 7.19038132e+01
1716.lowfreq: -9.2436 -0.0009 -0.0006 0.0010 0.2799 2.6260 12.8905 30.7514 31.1890
frequency: 12.8880 30.7514 31.1890 50.0978 62.7843 80.9250 95.4223 127.5884 147.9474 174.8642 180.1170 191.2728 210.8360 267.0124 291.1705 319.8173 349.4086 361.4301 385.4184 424.2242 426.1686 428.0438 485.8916 522.2782 525.8126 541.5995 546.4672 626.5276 645.4309 664.5525 684.5686 689.7511 697.9436 702.1231 704.4473 777.5948 786.7284 829.1679 830.0109 895.2043 921.5868 926.5761 933.3765 964.1879 964.6242 970.8327 987.5565 987.5627 988.1849 995.3067 1014.0646 1014.1046 1082.4320 1083.0939 1089.6661 1089.8664 1172.2765 1173.1027 1208.4295 1212.1052 1233.7443 1236.4061 1295.2107 1297.4670 1308.0315 1353.3173 1374.9175 1375.8707 1397.0607 1397.6716 1431.2136 1434.2247 1475.3377 1479.9788 1511.9454 1572.6560 1583.6387 1605.9220 1616.3863 1616.6370 3038.9350 3042.6195 3152.9782 3153.0161 3166.5943 3166.6438 3171.7736 3171.8303 3188.2364 3188.2610
redmass: 8.9099 8.6434 7.0495 11.8562 9.0986 4.9797 8.3201 6.5654 8.3021 5.0527 4.8841 8.9639 3.1006 7.3619 2.9758 5.9238 6.0909 11.6516 8.8315 3.1911 3.3504 8.4697 8.5474 4.3224 6.5974 5.5850 5.3603 6.3815 7.3205 8.8040 2.3971 2.1113 9.4356 4.9735 6.8549 9.2435 7.7119 1.4429 1.4507 4.3579 3.5036 1.4077 1.4547 1.3810 1.3832 9.3824 1.5940 6.0618 6.3901 1.5552 1.3773 1.3770 1.7948 1.8204 1.6143 1.6131 1.1503 1.1370 4.0383 4.5176 3.0063 2.3593 1.6110 1.3716 1.3788 2.1484 10.0360 10.4184 5.7612 4.9280 4.2388 3.8192 2.7001 2.9627 5.5195 6.7032 6.5201 6.9285 6.8744 7.0813 1.0886 1.0896 1.0880 1.0880 1.0923 1.0922 1.0945 1.0945 1.0971 1.0971
irintensity: 2.7350 3.0009 0.3147 0.0000 1.2457 0.0000 0.0000 14.5893 0.0000 0.0000 0.0401 4.6639 0.0000 0.0000 14.6797 0.0797 0.0000 3.9905 0.0000 1.1802 0.0000 4.0450 0.0000 19.9157 3.0871 0.0000 0.0000 0.0000 7.4634 0.0000 47.8107 0.0000 87.8927 43.5147 0.0004 0.0000 23.9250 64.0482 0.0014 2.6288 0.0000 5.6839 0.0000 9.1276 0.0050 0.0000 66.9009 1.4688 0.0001 0.0000 5.6350 0.0048 42.7851 0.0620 1.9108 64.9696 89.3487 0.0043 481.5410 0.1748 178.9305 0.0901 9.2598 0.0000 13.3526 0.0004 171.6654 4.1912 40.6751 0.0036 0.0008 67.7066 51.5815 0.0001 0.0000 8.8712 0.0000 115.6787 17.1407 0.0009 28.0900 0.0000 12.0590 0.0001 5.3593 1.7204 15.3253 0.1982 4.1963 4.3067
temp: 298.150 k
press: 1.00000 atm
elementType: 8 8 8 8 7 7 7 7 6 6 6 6 6 6 6 6 6 6 6 6 6 6 1 1 1 1 1 1 1 1 1 1
symmnumber: 1
zpe: 583914.8 jmol-1
zpe.correction: 0.222401 hartree
zpe.thermalcorrener: 0.241078 hartree
zpe.thermalcorrenthalpy: 0.242023 hartree
zpe.thermalcorrgfe: 0.171794 hartree
zpe.sumelectzpe: -1057.650732 hartree
zpe.sumelectthermal: -1057.632055 hartree
zpe.sumelectthermalent: -1057.631111 hartree
zpe.sumelectthermalfe: -1057.701340 hartree
dipole: -0.0015 0.0008 0.0002
dipole: 0.0017
quadrupole: -196.1089 -117.0738 -127.3489
quadrupole: 37.7045 -0.0002 0.0002
quadrupole: -49.2651 29.7701 19.4950 37.7045 -0.0002 0.0002
hfenergy: -1057.8731339 hartree
pointgroup: C01 [X(C14H10N4O4)]
dipole: -0.0005921 0.0003146 0.0000898 debye
polarizability: 506.6034338|7.1097358|210.0162149|-0.0016501|0.0003359|71.9038132 unknown
InChI: InChI=1S/C14H10N4O4/c19-17(20)13-5-1-3-11(7-13)9-15-16-10-12-4-2-6-14(8-12)18(21)22/h1-10H
charge 0 multiplicity 1
32 atoms
O  -7.797438 0.288261 -0.000021
O  7.796917 -0.288915 -0.000183
O  -6.443545 2.123518 -0.000255
O  6.443115 -2.124048 -0.000297
N  -6.634744 0.847132 -0.000068
N  6.634061 -0.84757 -0.000318
N  -0.591717 -0.404758 -0.000203
N  0.590931 0.404413 -0.000102
C  -3.015767 -0.279572 -0.000186
C  3.01498 0.279228 -0.00008
C  -5.437737 -0.03614 -0.000109
C  5.436958 0.035771 -0.000151
C  -4.16065 0.556868 -0.000153
C  4.159863 -0.557218 -0.000148
C  -3.186843 -1.695718 -0.000182
C  3.18605 1.695371 -0.000055
C  -5.622951 -1.434763 -0.000096
C  5.622159 1.434396 -0.000157
C  -4.476163 -2.260973 -0.000144
C  4.475373 2.260611 -0.000105
C  -1.683151 0.336389 -0.000228
C  1.682366 -0.336734 -0.000023
H  -4.075132 1.647919 -0.000167
H  4.074321 -1.648262 -0.000181
H  -2.2920 -2.32582 -0.000216
H  2.291211 2.325476 0.000001
H  -6.636294 -1.844427 -0.000046
H  6.635493 1.844072 -0.000174
H  -4.595568 -3.348852 -0.000143
H  4.594789 3.34849 -0.00009
H  -1.614991 1.438557 -0.000151
H  1.614206 -1.438902 -0.000071
