program: Gaussian 09
title: 000255303
version: EM64L-G09RevD.01
frameworkgroup: C1[X(C15H10N2OS2)]
method: RPBEPBE
basis: SDD
operation: Freq
keyword: #p
keyword: freq=noraman
keyword: PBEPBE/SDD
title: #p freq=noraman PBEPBE/SDD
converged: YES YES NO NO
title: Mulliken charges:
elementType: S S O N N C C C C C C C C C C C C C C C H H H H H H H H H H
charge: 0.238591 0.170624 -0.184221 -0.242279 -0.049724 0.481599 0.268286 -0.251590 -0.564333 -0.336154 -0.330153 -0.192822 0.161890 -0.213105 -0.204762 -0.232694 -0.269661 -0.194902 -0.168969 -0.369245 0.252104 0.260674 0.295889 0.233171 0.232918 0.233543 0.243570 0.245400 0.237697 0.248660
chargesum: 0.00000
title: Mulliken charges with hydrogens summed into heavy atoms:
elementType: S S O N N C C C C C C C C C C C C C C C
charge: 0.238591 0.170624 -0.184221 -0.242279 -0.049724 0.481599 0.268286 -0.251590 -0.564333 -0.084050 -0.069479 0.103067 0.161890 0.020065 0.028156 0.000848 -0.026091 0.050498 0.068728 -0.120584
polarizability: 4.25540872e+02 2.56427741e+01 2.13344615e+02 5.59739785e-01 6.42038337e+00 1.07856685e+02
1716.lowfreq: -0.0025 -0.0023 -0.0011 0.3769 4.3152 9.7954 28.3600 34.1249 39.7490
frequency: 28.3421 34.1150 39.7316 56.7973 72.9051 94.8700 100.5853 143.8738 188.4520 226.4901 242.3062 251.2988 275.2405 326.0406 378.7843 399.6151 404.6933 405.9076 436.5260 489.3540 521.7828 528.1791 550.8406 554.6866 595.9764 613.7670 623.7425 659.6072 691.2719 709.8350 720.0733 736.1725 773.5904 781.1171 786.9089 840.1710 868.2639 888.1878 919.2760 949.1235 953.6421 962.7048 971.9563 977.7435 990.7419 997.4093 1000.0338 1009.1409 1031.2012 1040.4369 1083.4312 1092.9525 1143.5899 1174.5406 1174.6060 1184.3008 1224.0736 1239.4397 1283.9765 1308.9210 1311.9142 1326.0269 1331.0402 1386.3175 1412.6542 1442.0296 1445.6878 1480.4787 1557.4639 1569.1830 1600.7316 1607.2763 1610.3391 1630.5323 3120.2246 3133.0450 3135.0315 3146.6314 3146.7702 3158.7936 3163.5965 3169.1122 3176.8378 3177.3225
redmass: 6.0477 4.2673 4.7447 6.1501 15.5186 7.4102 6.6773 7.3406 7.4076 7.2763 4.8814 6.8455 7.3822 12.5981 5.1541 5.8619 7.3426 2.9610 5.8481 4.3984 15.2253 2.7765 8.2683 7.0997 7.9048 6.4827 7.2796 6.8323 2.6630 2.5137 5.5052 1.7861 4.1275 2.9974 2.2233 1.2541 4.3675 1.3264 1.4651 1.4221 6.5664 1.4626 1.4856 6.4446 6.2242 1.3434 1.3556 5.4677 2.2458 2.4860 1.5516 1.7924 3.9698 1.0872 1.0778 1.1291 3.4991 2.8234 2.2797 1.9067 1.8319 2.8849 3.0231 10.2173 1.8554 2.2553 2.2980 2.3575 4.9337 5.5207 6.7676 6.4578 9.2448 10.6857 1.0877 1.0887 1.0854 1.0891 1.0892 1.0935 1.0938 1.0969 1.1013 1.1011
irintensity: 0.9808 2.5813 0.5286 1.3713 0.1311 0.4106 0.3400 0.8531 1.1713 1.4438 2.1277 7.5849 5.1327 2.2777 0.2114 4.2855 2.9173 0.9348 0.0845 3.5471 16.5026 14.3915 59.7474 29.9188 5.4748 1.3363 21.2035 9.2871 24.4109 28.0815 28.0835 24.0822 7.3850 43.6172 45.9523 0.0179 3.5833 0.1213 1.9877 12.4867 1.9075 4.8136 1.1676 19.8763 5.8085 1.0293 0.0499 1.5955 6.6701 7.8659 11.3294 30.6770 301.9960 1.9560 2.1571 8.8886 171.1594 265.4396 1.5979 1.3752 74.0531 112.0806 4.3450 3.1801 10.6430 5.9010 87.7291 50.1692 18.0117 11.1466 11.9277 8.6301 160.5681 78.7061 9.3194 24.2817 0.0130 8.3875 5.2411 32.8241 23.5443 11.4491 19.8999 6.2421
temp: 298.150 k
press: 1.00000 atm
elementType: 16 16 8 7 7 6 6 6 6 6 6 6 6 6 6 6 6 6 6 6 1 1 1 1 1 1 1 1 1 1
symmnumber: 1
zpe: 556218.0 jmol-1
zpe.correction: 0.211852 hartree
zpe.thermalcorrener: 0.228695 hartree
zpe.thermalcorrenthalpy: 0.229639 hartree
zpe.thermalcorrgfe: 0.164666 hartree
zpe.sumelectzpe: -1557.072884 hartree
zpe.sumelectthermal: -1557.056042 hartree
zpe.sumelectthermalent: -1557.055097 hartree
zpe.sumelectthermalfe: -1557.120071 hartree
dipole: -2.1215 0.9190 0.0741
dipole: 2.3132
quadrupole: -88.1635 -141.7384 -127.9838
quadrupole: -13.2976 2.0106 5.2872
quadrupole: 31.1317 -22.4432 -8.6885 -13.2976 2.0106 5.2872
hfenergy: -1557.2847367 hartree
pointgroup: C01 [X(C15H10N2O1S2)]
dipole: -0.8480318 -0.2891986 0.1595612 debye
polarizability: 423.0212488|-24.428262|183.1207972|24.6149761|-49.8914993|140.6001268 unknown
InChI: InChI=1S/C15H10N2OS2/c18-14-13(10-11-6-4-5-9-16-11)20-15(19)17(14)12-7-2-1-3-8-12/h1-10H
charge 0 multiplicity 1
30 atoms
S  -0.695051 -1.328822 1.280138
S  2.082051 -2.272894 2.227611
O  0.814674 1.483325 -1.043787
N  1.565457 -0.239214 0.408226
N  -4.178763 1.209104 -0.952013
C  2.969805 0.056084 0.173172
C  0.550054 0.538826 -0.261907
C  -0.810964 0.057123 0.105776
C  1.150973 -1.251491 1.277007
C  3.472495 1.328649 0.519322
C  3.800153 -0.921393 -0.416985
C  -1.928326 0.647156 -0.42629
C  -3.350155 0.363006 -0.233592
C  4.831064 1.623462 0.272695
C  5.157982 -0.619072 -0.655116
C  5.675501 0.651416 -0.311022
C  -3.880199 -0.667404 0.597888
C  -5.278168 -0.828526 0.689467
C  -6.122025 0.035655 -0.043845
C  -5.52128 1.036415 -0.847625
H  2.810823 2.076814 0.96569
H  3.390708 -1.900911 -0.680874
H  -1.734592 1.479604 -1.117135
H  5.226701 2.609831 0.536327
H  5.808222 -1.373464 -1.110246
H  6.729571 0.882658 -0.498976
H  -3.222533 -1.333111 1.16319
H  -5.700451 -1.615199 1.323049
H  -7.211397 -0.057378 0.001318
H  -6.137026 1.728652 -1.433263
