program: Gaussian 09
title: 000255289
version: EM64L-G09RevD.01
frameworkgroup: C1[X(C11H9NO4)]
method: RPBEPBE
basis: SDD
operation: Freq
keyword: #p
keyword: freq=noraman
keyword: PBEPBE/SDD
title: #p freq=noraman PBEPBE/SDD
converged: NO YES NO NO
title: Mulliken charges:
elementType: O O O O N C C C C C C C C C C C H H H H H H H H H
charge: -0.253302 -0.217654 -0.382428 -0.290004 -0.383283 0.192331 0.324766 0.082743 -0.506345 -0.379322 0.119403 0.329645 -0.340765 -0.342647 0.108879 -0.536851 0.306844 0.323277 0.227849 0.295692 0.249270 0.252483 0.221190 0.221220 0.377008
chargesum: 0.00000
title: Mulliken charges with hydrogens summed into heavy atoms:
elementType: O O O O N C C C C C C C C C C C
charge: -0.253302 -0.217654 -0.005420 -0.290004 -0.060006 0.192331 0.324766 0.082743 -0.199501 -0.151472 0.119403 0.329645 -0.045073 -0.093378 0.108879 0.158042
polarizability: 2.45788202e+02 -2.56856825e+00 1.51484839e+02 -5.61252715e-03 4.01513555e-03 5.95298373e+01
1716.lowfreq: -6.0281 -1.9637 -0.0004 0.0002 0.0009 5.0405 32.6106 44.7375 85.2908
frequency: 32.6022 44.7215 85.2883 116.3683 135.6723 180.7138 214.5945 233.6035 263.2992 272.8571 316.1337 335.5733 372.7241 395.8718 426.9583 496.9880 514.9953 527.1483 551.3548 562.5079 608.2487 618.5658 639.2295 676.7876 692.7810 704.4551 731.5061 754.2486 801.7547 811.4969 881.1722 923.4418 924.5884 945.3952 960.0184 1002.2460 1041.2857 1085.5319 1111.6944 1143.0188 1171.7997 1177.9926 1200.0508 1241.0237 1261.1883 1291.0143 1335.1525 1371.4583 1390.3493 1426.7366 1437.4598 1470.5092 1471.5546 1484.9840 1507.1918 1558.0667 1575.9858 1592.7122 1621.5725 1637.4827 2960.8227 3049.5166 3123.7083 3130.5064 3163.0050 3169.6175 3170.4324 3491.8074 3553.7357
redmass: 9.4842 7.4760 3.7550 4.2792 5.9638 5.1656 4.8481 1.3632 3.0604 6.2468 6.8861 4.1583 10.1588 7.0772 3.2725 5.7360 4.3057 5.3259 5.7071 2.9174 1.3392 6.6620 1.2187 5.6586 4.2069 5.9222 5.0748 6.6186 1.9758 3.1455 5.1128 1.4128 6.9993 1.4240 1.3698 3.4957 3.3952 2.7829 1.2587 1.4220 1.3409 1.7308 2.4679 2.4481 1.7356 1.9118 2.5373 4.4319 5.2887 4.8136 1.2121 1.0498 1.1053 2.2929 3.4122 9.3934 5.0008 5.5422 7.7896 6.7856 1.0331 1.1041 1.0900 1.0992 1.0940 1.0932 1.0924 1.0634 1.0780
irintensity: 6.6423 0.4896 4.6217 0.1959 0.6536 0.4639 1.1094 0.0368 2.0021 9.1553 5.5540 14.8327 7.3409 2.1644 1.0911 22.0343 13.3487 3.0054 50.0502 43.0657 43.9616 12.4744 112.0277 19.8477 38.5169 13.5304 15.7224 14.6691 13.5928 61.5474 11.7974 1.5697 39.8793 19.3988 7.3139 28.1200 292.1750 122.9043 0.1665 4.8460 8.9610 29.9709 8.0757 141.5673 142.5496 16.6254 60.6869 38.5457 12.9703 8.5225 15.9428 14.4689 101.2784 145.5736 104.8089 143.4610 130.1027 417.0905 236.4228 39.3966 78.8975 48.3371 15.4543 17.5102 4.5646 4.9852 13.8960 33.1448 65.3425
temp: 298.150 k
press: 1.00000 atm
elementType: 8 8 8 8 7 6 6 6 6 6 6 6 6 6 6 6 1 1 1 1 1 1 1 1 1
symmnumber: 1
zpe: 479552.3 jmol-1
zpe.correction: 0.182652 hartree
zpe.thermalcorrener: 0.196321 hartree
zpe.thermalcorrenthalpy: 0.197266 hartree
zpe.thermalcorrgfe: 0.141463 hartree
zpe.sumelectzpe: -779.088928 hartree
zpe.sumelectthermal: -779.075259 hartree
zpe.sumelectthermalent: -779.074315 hartree
zpe.sumelectthermalfe: -779.130117 hartree
dipole: -5.3777 6.3697 0.0003
dipole: 8.3363
quadrupole: -77.2263 -85.6024 -94.2170
quadrupole: -5.3261 -0.0027 -0.0047
quadrupole: 8.4556 0.0795 -8.5351 -5.3261 -0.0027 -0.0047
hfenergy: -779.2715803 hartree
pointgroup: C01 [X(C11H9N1O4)]
dipole: -2.1010245 2.5183641 0.0146465 debye
dipolederiv: -1.8283479 -0.3412177 0.0230092 -0.7693705 -0.4415169 0.0114433 0.0249007 0.0054516 -0.2958609 -0.4652616 -0.0181376 0.0020639 0.1404936 -1.0235174 0.0015344 0.0011194 0.0044109 -0.3288071 -0.4158735 0.3174003 -0.0014968 0.5888745 -1.093253 -0.0038043 -0.0038975 0.0017333 -0.386984 -1.3559763 -0.2077415 0.0154554 -0.2561067 -0.6721271 0.0061092 0.0125129 0.0039163 -0.3578216 -1.104697 0.3144155 0.0101554 0.2389705 -0.5208041 -0.0016213 0.0107851 -0.0026135 -0.2393034 -0.1229157 0.342537 -0.0003988 0.2426041 -0.0537936 -0.0032001 0.0002265 -0.0044812 -0.0201188 0.4653278 0.2731955 -0.0073227 0.2407223 0.0134117 -0.0031003 -0.0070003 -0.0037594 0.045659 0.7853743 0.0712268 -0.0089634 -0.1223393 1.1603838 -0.0035744 -0.0077926 -0.006871 0.1713517 -0.5443787 -0.3042784 0.0075496 0.1255251 0.0126777 -0.0023632 0.0052876 0.00363 -0.1120424 0.0168747 -0.2099359 -0.0013805 0.0503049 0.1180643 -0.0022218 -0.0027884 0.0014613 -0.162296 -0.9593808 -0.1416412 0.0121767 0.6708795 -0.7312133 -0.0055711 0.0085996 0.0053629 -0.1002727 1.350526 0.607809 -0.0206485 1.0365235 0.2705256 -0.0152941 -0.0225746 -0.009395 0.0873675 0.6445707 -0.4980662 -0.0061933 -0.9961516 0.7418349 0.0096501 -0.003186 0.0026235 0.0002186 -0.129682 0.0688658 -0.0011897 -0.4581893 -0.0263313 0.0055142 0.001552 -0.0018058 -0.1818727 2.2903207 -0.2335444 -0.0266957 -0.4487923 1.3560542 -0.0014963 -0.0230542 -0.0042612 0.2280845 0.9922584 0.0488609 -0.0095057 -0.2755486 0.1952035 0.0044918 -0.0077021 0.0000537 0.329753 0.1453598 0.0307411 0.0001061 -0.0454607 0.0588561 0.0011662 0.000479 0.000118 0.163748 0.1340564 0.0578503 0.0022749 -0.029248 0.2282226 0.0008717 0.0026128 -0.0003837 0.3207667 0.0755233 -0.0360003 0.0014887 0.0050071 -0.1160436 0.0014426 0.0012665 0.0019937 0.167688 0.1146733 -0.0701308 0.0011671 -0.0518081 0.0771169 0.0012321 0.0011873 0.0014668 0.1686455 -0.0696584 0.069739 0.0029233 0.0732599 0.0845763 -0.0006006 0.0029053 -0.0005394 0.1641419 -0.0503218 -0.08716 0.0028255 -0.1477657 -0.0191641 0.0026593 0.0031074 0.0018409 0.1257723 -0.0335287 -0.0132408 0.0049743 0.1741158 0.0170508 0.1211522 -0.0640229 0.0967515 -0.088687 -0.0321529 -0.0159153 -0.0061957 0.1713646 0.015018 -0.1268718 0.0609095 -0.0973449 -0.0881925 0.0973099 -0.025631 0.0038206 -0.1578646 0.3487679 0.0024521 0.0045668 0.0006405 0.3890624 unknown
polarizability: 245.7202478|-3.1281795|151.5153192|-2.5375658|-0.472835|59.5673113 unknown
InChI: InChI=1S/C11H9NO4/c1-16-6-2-3-9-7(4-6)10(13)8(5-12-9)11(14)15/h2-5,12,14H,1H3
charge 0 multiplicity 1
25 atoms
O  -3.8808 -1.213495 0.019088
O  1.065586 -2.11214 -0.043854
O  3.813834 -1.682431 -0.081892
O  4.545992 0.510166 -0.104722
N  0.710204 2.037434 -0.062308
C  -0.344771 -0.158248 -0.035671
C  -0.468209 1.263746 -0.041605
C  0.998226 -0.842814 -0.051081
C  -1.517121 -0.94236 -0.015007
C  -1.743808 1.875851 -0.026949
C  2.153548 0.082648 -0.071984
C  -2.790313 -0.33601 -0.000451
C  1.949883 1.464599 -0.076493
C  -2.905267 1.084097 -0.006394
C  3.583421 -0.311449 -0.089865
C  -5.227204 -0.634479 0.034601
H  -1.416529 -2.031809 -0.010726
H  0.627326 3.055337 -0.066531
H  -1.831949 2.969178 -0.031539
H  2.817671 2.131287 -0.092205
H  -3.883865 1.571797 0.004798
H  -5.907426 -1.498073 0.047782
H  -5.415507 -0.026505 -0.871666
H  -5.391125 -0.018152 0.939956
H  4.801403 -1.821475 -0.092783
