program: Gaussian 09
title: 000255325
version: EM64L-G09RevD.01
frameworkgroup: C1[X(C18H32O9S)]
method: RPBEPBE
basis: SDD
operation: Freq
keyword: #p
keyword: freq=noraman
keyword: PBEPBE/SDD
title: #p freq=noraman PBEPBE/SDD
converged: NO NO NO NO
title: Mulliken charges:
elementType: S O O O O O O O O O C C C C C C C C C C C C C C C C C C H H H H H H H H H H H H H H H H H H H H H H H H H H H H H H H H
charge: 1.044330 -0.333911 -0.298831 -0.311060 -0.271502 -0.429047 -0.261046 -0.250528 -0.498553 -0.518840 -0.018749 -0.117379 -0.079882 -0.083371 -0.411174 -0.396563 0.384783 0.365046 -0.040961 -0.410355 -0.414421 -0.702173 -0.692129 -0.700606 -0.689161 -0.392543 -0.303371 -0.722604 0.229841 0.291980 0.275653 0.290892 0.230017 0.247068 0.209747 0.232459 0.250295 0.232965 0.205336 0.216488 0.218163 0.245380 0.219900 0.212571 0.233008 0.222411 0.218835 0.217109 0.219601 0.245119 0.219949 0.225687 0.247482 0.201428 0.208922 0.199545 0.217996 0.294682 0.286862 0.287214
chargesum: 0.00000
title: Mulliken charges with hydrogens summed into heavy atoms:
elementType: S O O O O O O O O O C C C C C C C C C C C C C C C C C C
charge: 1.044330 -0.333911 -0.298831 -0.311060 -0.271502 -0.429047 -0.261046 -0.250528 -0.498553 -0.518840 0.211092 0.174601 0.195771 0.207521 0.065911 0.045643 0.384783 0.365046 0.209335 0.027946 0.020230 -0.024323 -0.017876 -0.018778 0.003957 0.017807 0.114170 0.146154
polarizability: 2.62536724e+02 -8.55417852e+00 2.74002355e+02 -1.17698305e-01 7.58854307e+00 2.25287452e+02
1716.lowfreq: -15.7501 -6.0032 -0.0014 -0.0009 -0.0008 5.6288 12.7426 18.4496 26.1331
frequency: 1.5386 16.7621 26.0727 32.2342 39.6755 48.4927 53.5551 55.6821 76.8461 77.9553 82.1934 109.2089 110.9602 122.8405 147.7537 157.3913 162.0319 171.6741 176.1368 183.5556 200.1226 213.8172 221.0896 224.5453 235.6022 243.9786 244.7510 253.5994 279.5766 298.5490 309.3826 318.3911 334.0291 344.1872 345.5758 351.2215 368.9755 391.2034 396.9283 408.6883 428.2577 441.3099 463.3192 474.4296 487.1486 505.2689 517.7721 546.8182 557.3961 600.5516 611.0072 618.5659 648.9124 672.6711 690.0629 736.7156 737.3053 745.0149 750.2895 771.6318 788.9121 829.7403 845.4992 858.4655 861.5680 881.3034 882.1333 894.6058 909.4645 914.1187 919.6781 926.8460 933.6839 939.9074 950.5395 974.6099 979.5470 982.1056 983.0436 989.7219 993.0202 1002.7895 1011.3469 1022.9756 1028.1864 1034.6988 1050.9139 1082.8963 1083.5665 1107.8950 1115.9046 1125.4857 1131.9354 1135.4827 1148.9925 1166.6702 1182.6108 1183.1936 1192.2579 1201.9046 1205.9101 1234.9198 1252.8300 1254.0637 1260.8307 1265.0115 1272.1131 1280.3881 1291.6450 1299.0589 1308.4424 1316.6110 1322.4560 1324.9936 1329.6593 1342.5884 1345.4566 1353.9704 1359.1045 1363.5448 1367.8975 1376.0831 1376.9263 1383.2126 1389.5654 1395.4018 1414.2467 1417.1392 1444.8911 1450.8335 1452.2916 1453.1360 1453.4076 1456.4982 1459.4787 1468.1718 1470.5058 1472.1200 1474.4169 1477.1105 1486.9500 1489.0816 2984.2708 2985.0964 2987.5847 2993.0748 2993.3641 2995.1927 2995.7645 2996.4838 3003.4849 3006.6816 3007.6205 3008.0217 3039.6140 3044.3470 3055.5244 3057.9087 3060.4783 3078.0507 3078.4576 3086.0756 3092.7257 3096.4732 3096.8792 3100.3149 3103.4307 3105.0678 3107.7058 3115.9115 3119.2282 3121.3636 3186.8447 3196.4184
redmass: 7.3819 5.3671 3.6492 3.9813 4.0620 4.2916 4.2532 4.6924 4.4610 3.9292 4.5797 4.3992 5.9816 4.6508 1.1001 1.8350 1.4382 1.2643 2.5886 4.7573 2.9268 2.4392 1.4697 1.3488 2.1427 3.5860 2.3760 2.7586 4.8859 3.6594 3.8441 4.1498 3.2435 2.4762 4.0292 3.5310 3.5194 2.8437 3.2627 3.4799 3.7016 3.8994 3.5361 3.4278 3.9795 4.0272 2.3170 5.9286 3.7633 8.2509 4.4029 4.6877 3.7978 3.9384 4.1952 7.8824 7.4543 3.3181 3.3896 4.1349 2.2634 12.5123 2.3091 4.4701 2.7871 2.9464 3.0637 3.0755 3.0568 1.6733 1.7221 1.7935 2.0472 1.9398 3.8319 3.9813 2.8832 1.3580 3.7378 1.4464 1.7613 2.4057 2.6992 2.7006 4.0775 1.9947 1.8828 2.5652 2.3605 2.0269 2.4573 2.4438 2.1698 1.8846 2.4091 1.2859 1.3279 1.4005 1.2469 2.5659 2.7139 1.2345 2.2323 1.4039 2.4476 1.4226 1.2110 1.2018 1.2043 1.2723 1.2745 1.1358 1.2304 1.1994 1.2234 1.3931 1.4524 1.4407 1.3106 1.3270 1.2982 1.3417 1.3014 1.2838 1.2351 1.2215 1.0514 1.0519 1.0897 1.0509 1.0511 1.0499 1.0896 1.0479 1.0852 1.0663 1.0724 1.0522 1.0870 1.0510 1.0784 1.0715 1.0588 1.0643 1.0594 1.0440 1.0549 1.0774 1.0609 1.0485 1.0357 1.0357 1.0712 1.0786 1.0249 1.1000 1.0867 1.0966 1.0930 1.1025 1.0884 1.0991 1.1003 1.1001 1.1000 1.1001 1.0993 1.0994 1.0994 1.1008 1.1006 1.1007 1.1078 1.1075
irintensity: 1.8205 3.7981 0.2366 0.6520 0.2715 0.9840 0.1079 2.0873 1.1962 0.0436 0.6649 7.7401 0.4510 2.1004 0.3369 0.4484 0.2065 1.1966 4.7406 0.9319 10.2130 3.0372 3.7910 4.9034 2.2439 1.4433 3.3366 3.1503 1.7488 11.8581 22.8994 4.7894 0.9388 2.2390 13.5454 9.5280 16.4581 1.7384 15.0493 3.4359 0.2751 8.4841 3.1602 14.2956 24.0798 4.9189 4.1644 18.3430 38.4829 41.2392 1.5185 9.5917 3.3068 21.8792 6.0432 29.4695 17.4365 67.3205 21.7630 46.2328 36.2004 57.4605 33.8623 89.6088 7.8903 160.7582 45.9910 22.5251 33.4470 2.8474 3.4936 87.8018 8.7295 8.2241 73.4221 71.3899 5.2847 7.0086 77.4559 18.7434 73.4265 39.5546 46.9665 37.7903 54.1011 48.3505 8.6049 3.2169 2.2729 13.1502 0.5828 26.8787 8.4427 98.7160 9.7496 3.1878 35.0281 14.0902 20.3230 101.0167 82.4395 3.7784 28.1549 39.4085 66.6449 4.1101 8.8505 3.0019 0.7375 14.1697 20.7137 4.4950 5.4467 3.8209 5.2796 0.7567 2.2632 4.4322 0.6319 10.5070 1.0035 17.4258 32.0372 38.6088 28.8405 25.4904 10.8692 11.5967 10.0842 3.0093 4.4377 1.7865 10.2827 0.9266 6.2587 2.1661 0.2878 16.8107 13.7593 17.4444 11.1322 3.4424 43.0229 38.9987 28.0688 20.6582 11.2635 4.4014 32.0334 19.8327 15.5107 15.2449 12.1815 6.6028 0.1796 42.2191 7.6699 27.5724 44.4053 35.8999 0.4212 34.2304 22.8725 2.0780 8.1239 29.7371 15.7385 37.4243 29.0187 16.8756 23.3071 18.1007 0.1111 0.0738
temp: 298.150 k
press: 1.00000 atm
elementType: 16 8 8 8 8 8 8 8 8 8 6 6 6 6 6 6 6 6 6 6 6 6 6 6 6 6 6 6 1 1 1 1 1 1 1 1 1 1 1 1 1 1 1 1 1 1 1 1 1 1 1 1 1 1 1 1 1 1 1 1
symmnumber: 1
zpe: 1289585.5 jmol-1
zpe.correction: 0.491177 hartree
zpe.thermalcorrener: 0.522997 hartree
zpe.thermalcorrenthalpy: 0.523941 hartree
zpe.thermalcorrgfe: 0.423838 hartree
zpe.sumelectzpe: -1777.713808 hartree
zpe.sumelectthermal: -1777.681988 hartree
zpe.sumelectthermalent: -1777.681044 hartree
zpe.sumelectthermalfe: -1777.781147 hartree
dipole: -0.9447 -1.5375 -2.2120
dipole: 2.8547
quadrupole: -174.9959 -177.6462 -161.1085
quadrupole: 5.4521 11.5846 7.3892
quadrupole: -3.7457 -6.3960 10.1417 5.4521 11.5846 7.3892
hfenergy: -1778.2049848 hartree
pointgroup: C01 [X(C18H32O9S1)]
dipole: 0.4548964 0.5463693 -0.8694394 debye
polarizability: 228.6317273|-2.3057087|260.6708726|13.7723725|8.2991865|272.5239309 unknown
InChI: InChI=1S/C18H32O9S/c1-17(2)22-10-12(25-17)15(24-14-8-6-7-9-21-14)16(27-28(5,19)20)13-11-23-18(3,4)26-13/h12-16H,6-11H2,1-5H3
charge 0 multiplicity 1
60 atoms
S  -0.660343 1.387452 -3.202789
O  1.775753 0.074654 1.847229
O  -0.805293 -1.399139 -0.427718
O  -0.934914 2.074717 1.668805
O  1.680576 -1.920005 3.104073
O  0.460925 1.299716 -1.700477
O  -0.824669 4.31831 0.984571
O  0.340919 -3.421867 -1.147213
O  -0.627554 0.008972 -4.047719
O  -2.08665 2.00648 -2.733677
C  0.243733 -0.450542 0.016709
C  -0.211877 0.971463 -0.407423
C  0.48745 -0.618921 1.534959
C  0.070525 2.145181 0.565496
C  0.758453 -2.075322 1.961589
C  -0.164723 3.53648 -0.076523
C  2.594223 -0.822807 2.735642
C  -1.707623 3.36145 1.684352
C  -0.431941 -2.259543 -1.578349
C  -1.730153 -2.635121 -2.3100
C  -2.561532 -3.67798 -1.531306
C  2.969157 -0.074089 4.011543
C  3.796962 -1.335905 1.925399
C  -1.853797 3.826665 3.13011
C  -3.041713 3.167447 0.943443
C  -1.678243 -4.902804 -1.198019
C  -0.447746 -4.43624 -0.404566
C  0.391261 2.694879 -4.081475
H  1.206266 -0.684736 -0.481306
H  -1.310504 0.942241 -0.563005
H  -0.312583 -0.152975 2.134155
H  1.063323 2.048416 1.030165
H  -0.133682 -2.59222 2.342522
H  1.21893 -2.656922 1.13962
H  -0.815565 3.466502 -0.970094
H  0.769727 4.061737 -0.324953
H  0.261094 -1.706695 -2.234528
H  -2.304536 -1.713404 -2.498832
H  -1.441282 -3.047503 -3.29564
H  -2.939346 -3.226439 -0.593958
H  -3.440675 -3.981273 -2.129181
H  2.058381 0.307929 4.499091
H  3.490394 -0.755113 4.706887
H  3.635397 0.77371 3.778216
H  3.457738 -1.938944 1.065854
H  4.384155 -0.483462 1.542411
H  4.447452 -1.960654 2.561905
H  -2.460732 3.107093 3.70537
H  -2.349048 4.812515 3.158698
H  -0.858679 3.909734 3.594659
H  -3.639435 4.094278 0.989196
H  -3.609976 2.352089 1.424342
H  -2.8862 2.900755 -0.1166
H  -2.238459 -5.6472 -0.599602
H  -1.349854 -5.398901 -2.132064
H  -0.771317 -4.011625 0.566758
H  0.26818 -5.254616 -0.22079
H  1.395875 2.26133 -4.169698
H  -0.083953 2.871591 -5.056468
H  0.369946 3.580482 -3.433898
