program: Gaussian 09
title: 000255276
version: EM64L-G09RevD.01
frameworkgroup: C1[X(C10H17ClN2O5)]
method: RPBEPBE
basis: SDD
operation: Freq
keyword: #p
keyword: freq=noraman
keyword: PBEPBE/SDD
title: #p freq=noraman PBEPBE/SDD
converged: YES YES NO NO
title: Mulliken charges:
elementType: Cl O O O O O N N C C C C C C C C C C H H H H H H H H H H H H H H H H H
charge: -0.086634 -0.251268 -0.270367 -0.252715 -0.313723 -0.234592 -0.452956 -0.395557 -0.150183 -0.390182 -0.498468 0.179529 0.297453 0.242305 -0.334103 -0.549449 -0.498526 -0.504362 0.304081 0.282969 0.236810 0.256046 0.249426 0.328131 0.300662 0.242347 0.267608 0.282166 0.265566 0.239888 0.246562 0.244556 0.233192 0.241714 0.242078
chargesum: 0.00000
title: Mulliken charges with hydrogens summed into heavy atoms:
elementType: Cl O O O O O N N C C C C C C C C C C
charge: -0.086634 -0.251268 -0.270367 -0.252715 -0.313723 -0.234592 -0.124825 -0.094895 0.153898 0.129597 0.007003 0.179529 0.297453 0.242305 0.175852 -0.001718 0.232479 0.212622
polarizability: 1.69860259e+02 5.95780146e+00 1.36531592e+02 2.24365714e-01 -2.72335247e-01 1.37700137e+02
1716.lowfreq: -7.0121 -4.4984 -0.5480 -0.0014 -0.0009 -0.0001 9.8899 16.7573 20.0353
frequency: 9.8394 16.7395 19.9988 30.2280 44.0478 55.5046 63.2428 73.6875 81.5635 90.6187 99.9407 108.2862 128.2154 156.4308 174.9624 187.6944 203.8679 243.6787 256.5401 279.1595 307.7505 319.6254 368.9379 407.6558 425.8045 459.1450 497.0646 551.0941 570.0878 589.2091 598.4818 619.6857 664.7171 699.0071 715.6066 745.9881 783.9365 817.1210 847.9793 863.5107 900.0292 952.9225 961.3290 972.1500 989.3697 1038.5379 1043.7895 1081.1657 1112.9551 1113.3086 1114.8110 1127.8438 1148.3420 1151.2855 1156.6571 1168.1936 1179.8688 1200.5253 1222.5606 1232.1731 1242.2864 1285.2707 1297.6022 1314.7511 1332.2969 1368.3955 1371.6604 1422.5831 1423.4573 1437.8994 1439.4616 1443.3307 1452.7401 1453.0144 1457.5069 1462.6088 1464.8015 1470.9944 1506.9196 1613.3770 1629.6427 1647.8218 2984.3529 2995.0464 3003.2240 3004.5113 3009.4969 3028.7063 3051.0238 3053.1768 3064.6210 3095.9880 3106.0192 3113.3785 3148.9955 3152.9427 3156.8864 3497.0875 3550.2618
redmass: 9.0140 5.8336 6.0526 3.6165 4.5330 3.4918 3.7636 2.1212 2.5209 3.9027 1.0846 3.8051 4.8714 3.2460 4.2551 3.5759 4.2185 5.1106 4.6052 4.2272 3.5553 3.4570 3.5803 4.0522 1.5828 2.5223 2.8628 3.4871 2.1114 2.9305 2.3986 3.2953 5.5630 4.0620 6.4116 4.0429 1.7353 2.8632 5.5604 2.5284 4.1308 3.9241 4.5420 2.4999 2.2877 2.4739 2.0081 2.7134 1.3591 1.2666 3.0807 2.7707 1.4412 1.4461 1.4760 2.1730 1.5531 1.9389 1.6159 1.4747 1.4047 1.1533 1.2184 1.6401 1.4128 1.5489 1.3240 1.1888 1.1973 1.1330 1.1166 1.0923 1.0500 1.0507 1.5189 1.0580 1.0515 1.1130 2.5236 7.2202 6.4415 9.0515 1.0629 1.0595 1.0805 1.0296 1.0299 1.0618 1.0961 1.0927 1.0663 1.1033 1.1045 1.1049 1.1048 1.1119 1.1052 1.0773 1.0773
irintensity: 0.1979 1.2001 0.4792 0.1522 0.5980 0.7254 2.7860 3.3479 2.2348 13.3264 0.1734 6.5879 6.8103 5.2146 4.7156 2.2143 4.8632 20.7300 1.2813 25.4935 25.1653 22.1069 8.1195 1.1140 10.0240 19.6499 5.4494 11.3877 83.6683 94.8747 51.7174 50.9352 4.1886 3.8959 30.7282 4.1369 19.0379 24.1626 9.4052 9.4469 8.3311 29.1856 25.2874 13.0449 2.7226 22.2915 8.0109 12.5562 4.0656 0.8467 59.4600 227.4227 8.2879 4.0620 1.5659 228.1637 50.2929 15.7992 8.7085 95.8863 118.2978 5.1235 27.2836 121.7453 105.7208 23.6901 2.7826 24.2521 26.5611 19.1535 25.8103 13.1674 13.6908 16.3476 46.8175 12.4089 13.0522 24.2924 699.4213 277.4541 22.7532 174.2898 11.2958 52.2873 19.5186 32.7574 24.8597 13.6326 7.6217 6.4242 20.8369 11.8695 27.3508 22.8985 16.5165 16.6494 12.2605 69.2523 26.1730
temp: 298.150 k
press: 1.00000 atm
elementType: 17 8 8 8 8 8 7 7 6 6 6 6 6 6 6 6 6 6 1 1 1 1 1 1 1 1 1 1 1 1 1 1 1 1 1
symmnumber: 1
zpe: 721339.9 jmol-1
zpe.correction: 0.274744 hartree
zpe.thermalcorrener: 0.296382 hartree
zpe.thermalcorrenthalpy: 0.297326 hartree
zpe.thermalcorrgfe: 0.217545 hartree
zpe.sumelectzpe: -1335.553111 hartree
zpe.sumelectthermal: -1335.531472 hartree
zpe.sumelectthermalent: -1335.530528 hartree
zpe.sumelectthermalfe: -1335.610309 hartree
dipole: -2.3845 -1.0581 -1.9717
dipole: 3.2700
quadrupole: -94.6480 -102.8864 -126.9258
quadrupole: 1.2207 8.8675 -1.9657
quadrupole: 13.5054 5.2670 -18.7724 1.2207 8.8675 -1.9657
hfenergy: -1335.8278546 hartree
pointgroup: C01 [X(C10H17Cl1N2O5)]
dipole: 0.9256648 -0.5500988 0.7040473 debye
polarizability: 167.3956124|-10.3237558|138.8514735|-2.0552192|1.0254851|137.8449019 unknown
InChI: InChI=1S/C10H17ClN2O5/c1-17-8(14)4-3-7(9(15)18-2)13-10(16)12-6-5-11/h7,12-13H,3-6H2,1-2H3
charge 0 multiplicity 1
35 atoms
Cl -4.956327 1.849521 1.869062
O  2.242574 -2.809786 -0.25198
O  3.130203 2.55192 0.698844
O  0.867126 -2.558897 1.608989
O  -2.057261 -0.545593 -1.728494
O  2.014001 2.62598 -1.343829
N  -0.886709 -1.003763 0.24194
N  -3.143891 -0.351064 0.340821
C  0.325691 -1.374171 -0.494753
C  1.159598 -0.144313 -0.96473
C  1.659411 0.722124 0.205847
C  1.140439 -2.298725 0.410747
C  -2.032134 -0.628548 -0.457873
C  2.255011 2.037267 -0.265829
C  -4.405901 0.080735 -0.257334
C  -4.726775 1.553519 0.001619
C  3.118004 -3.711912 0.541202
C  3.733097 3.869149 0.377124
H  0.039686 -1.931658 -1.408227
H  0.515797 0.455957 -1.629722
H  2.010747 -0.50974 -1.566325
H  0.807779 0.964151 0.874171
H  2.408304 0.200982 0.829159
H  -0.915373 -1.276499 1.229515
H  -3.06185 -0.307547 1.358096
H  -5.240743 -0.55096 0.099941
H  -4.301461 -0.066141 -1.349572
H  -3.907217 2.222082 -0.297946
H  -5.680864 1.857485 -0.454362
H  3.935368 -3.976915 -0.142809
H  2.552841 -4.605239 0.854325
H  3.49549 -3.186896 1.434212
H  4.371237 4.103653 1.240466
H  2.944264 4.628966 0.246214
H  4.325638 3.80167 -0.550704
