program: Gaussian 09
title: 000255256
version: EM64L-G09RevD.01
frameworkgroup: C1[X(C18H24N2O2)]
method: RPBEPBE
basis: SDD
operation: Freq
keyword: #p
keyword: freq=noraman
keyword: PBEPBE/SDD
title: #p freq=noraman PBEPBE/SDD
converged: YES YES NO NO
title: Mulliken charges:
elementType: O O N N C C C C C C C C C C C C C C C C C C H H H H H H H H H H H H H H H H H H H H H H H H
charge: -0.269910 -0.269911 -0.200814 -0.200788 -0.363582 -0.363571 0.435493 0.435475 -0.685758 -0.685761 -0.397200 -0.397187 -0.322183 -0.322217 -0.364487 -0.364508 -0.366396 -0.366359 0.315297 0.315296 -0.537292 -0.537293 0.240043 0.211224 0.240041 0.211222 0.235671 0.219483 0.214403 0.235686 0.219475 0.214397 0.229014 0.229021 0.255252 0.255251 0.234254 0.234255 0.244885 0.244883 0.216191 0.215110 0.241298 0.215113 0.241298 0.216189
chargesum: 0.00000
title: Mulliken charges with hydrogens summed into heavy atoms:
elementType: O O N N C C C C C C C C C C C C C C C C C C
charge: -0.269910 -0.269911 -0.200814 -0.200788 0.087685 0.087692 0.435493 0.435475 -0.016202 -0.016203 -0.168186 -0.168166 -0.066931 -0.066966 -0.130233 -0.130253 -0.121511 -0.121476 0.315297 0.315296 0.135307 0.135306
polarizability: 3.04935010e+02 -9.59827437e-03 2.08122689e+02 1.45314959e+01 -6.78753384e-03 1.77341763e+02
1716.lowfreq: -6.4940 -0.0004 0.0005 0.0007 8.8543 16.7064 22.3437 33.0962 47.5765
frequency: 21.7972 32.5450 47.5383 56.8027 58.9897 75.4640 79.7698 107.5191 132.3666 135.9947 136.8747 163.1532 181.2720 193.9889 208.4915 218.1679 235.0521 249.4521 250.7339 307.6606 321.0261 332.9375 348.4776 353.5486 364.4060 412.3979 417.8111 418.6813 467.3277 468.0653 514.1455 516.8390 526.3601 539.2267 562.7533 612.9886 631.6775 632.7287 698.1175 710.4749 712.2717 757.4917 782.4276 783.8567 788.6220 790.4293 820.1734 822.3480 825.0294 903.6970 903.8667 912.1806 918.9807 949.5293 950.8052 985.7331 986.8837 994.3910 1000.2335 1007.7763 1068.0057 1077.2587 1096.0150 1114.5721 1114.5755 1119.4972 1122.6984 1132.8823 1145.8834 1158.1673 1159.2167 1185.0411 1185.1568 1224.2960 1224.4072 1227.3389 1268.9018 1271.9698 1306.1501 1307.1764 1328.3858 1350.3335 1358.5054 1365.7344 1376.3472 1379.4676 1380.2831 1387.7663 1430.1113 1432.2787 1437.2090 1437.6363 1464.0725 1464.7353 1465.1344 1465.1443 1470.7222 1470.9340 1475.3886 1476.1731 1485.9861 1486.5869 1501.0213 1506.3017 1578.8186 1579.1873 1632.2844 1634.6775 2948.4558 2948.6214 2968.3826 2968.8817 2983.7794 2984.2566 3031.2525 3031.2734 3053.8823 3054.0878 3078.6252 3079.4389 3091.6483 3093.2456 3117.6580 3117.6960 3144.2497 3144.2747 3150.7784 3151.2481 3165.4584 3165.5398 3172.8882 3173.3734
redmass: 5.3145 3.5030 3.2615 3.2037 3.4711 3.3395 3.5292 3.0789 3.6728 4.7515 3.5543 2.1166 2.0285 1.4482 1.3097 2.5725 1.8831 1.2999 1.5343 2.5604 3.9746 2.9605 3.5846 4.1369 5.4887 3.6091 3.0880 3.2320 4.2979 3.7758 2.4296 2.6067 3.9285 3.6985 3.6930 4.3071 6.8121 7.0842 2.9041 3.7657 3.7468 2.3034 2.1858 1.6463 1.3512 1.3845 1.5381 2.0212 1.5165 1.3729 1.3582 2.4726 2.4967 1.3258 1.3229 4.5500 5.0552 3.8293 3.5062 2.5973 2.4451 1.9584 2.3576 1.2601 1.2600 1.3569 1.5541 1.9656 1.7025 1.3291 1.3184 1.3126 1.3072 2.5655 2.3985 2.9826 1.7049 1.8616 1.3017 1.3390 1.7051 1.3803 1.5869 2.6400 1.6409 2.7479 2.1813 1.3724 3.7093 3.4795 1.1780 1.1901 1.0463 1.0689 1.0504 1.0504 1.0494 1.1098 1.0909 1.0831 1.0600 1.0658 2.3068 2.5156 7.5879 7.3885 6.5512 6.4146 1.0334 1.0335 1.0670 1.0661 1.0358 1.0358 1.1034 1.1034 1.0958 1.0957 1.0988 1.0982 1.1008 1.1005 1.0985 1.0985 1.0863 1.0863 1.0873 1.0874 1.0948 1.0948 1.0961 1.0960
irintensity: 0.0863 2.1103 0.0505 0.4969 2.6018 1.6370 2.2653 1.1104 0.7738 3.8670 2.9806 0.6489 0.0933 2.6371 0.3506 0.9842 2.7052 0.1202 2.0004 5.1650 6.3318 4.3136 0.0117 0.7330 2.6543 2.6912 0.0135 0.2593 13.3589 4.7089 18.9614 16.4170 13.7193 5.1077 3.3491 12.1796 0.6465 0.3933 52.8856 1.5371 0.5128 16.3763 3.9369 2.4056 29.5226 30.7100 60.2400 5.6600 58.0536 0.1782 0.2002 3.3868 3.8066 0.1534 0.0752 5.5763 36.7939 2.5840 111.9440 24.5804 4.9914 0.0403 10.0041 0.2596 0.1423 0.7931 23.4939 1.3195 38.8551 0.0472 8.1741 97.3269 14.1165 133.7239 307.6045 9.5262 33.7996 20.0043 3.4372 0.3552 35.0356 49.3486 12.6220 1.9573 2.0881 0.8137 45.0260 60.0214 12.8893 0.0826 23.5746 14.0587 8.2414 0.1330 11.2838 13.0466 3.1685 29.7252 150.1407 43.0948 5.1205 4.9746 498.5229 202.6333 1.1140 3.7513 10.5269 4.4970 172.0582 3.3097 67.0940 2.6819 9.6587 58.8667 55.0744 57.8461 0.3187 13.7870 80.0505 5.4577 68.8477 18.9596 36.1879 27.3469 24.9275 14.5430 10.6618 4.7183 35.7118 8.2635 4.4261 0.1690
temp: 298.150 k
press: 1.00000 atm
elementType: 8 8 7 7 6 6 6 6 6 6 6 6 6 6 6 6 6 6 6 6 6 6 1 1 1 1 1 1 1 1 1 1 1 1 1 1 1 1 1 1 1 1 1 1 1 1
symmnumber: 1
zpe: 1007792.7 jmol-1
zpe.correction: 0.383848 hartree
zpe.thermalcorrener: 0.406643 hartree
zpe.thermalcorrenthalpy: 0.407587 hartree
zpe.thermalcorrgfe: 0.330949 hartree
zpe.sumelectzpe: -958.542717 hartree
zpe.sumelectthermal: -958.519922 hartree
zpe.sumelectthermalent: -958.518978 hartree
zpe.sumelectthermalfe: -958.595616 hartree
dipole: -0.0008 2.6772 0.0007
dipole: 2.6772
quadrupole: -109.0773 -131.4833 -127.5094
quadrupole: -0.0045 17.6354 -0.0026
quadrupole: 13.6127 -8.7933 -4.8194 -0.0045 17.6354 -0.0026
hfenergy: -958.926565 hartree
pointgroup: C01 [X(C18H24N2O2)]
dipole: -0.000219 -1.0532925 0.0000103 debye
polarizability: 305.4804228|-0.0546804|208.122714|-11.8857816|0.02044|176.7963249 unknown
InChI: InChI=1S/C18H24N2O2/c1-5-19(15-7-11-17(21-3)12-8-15)20(6-2)16-9-13-18(22-4)14-10-16/h7-14H,5-6H2,1-4H3
charge 0 multiplicity 1
46 atoms
O  4.865052 2.199307 0.898643
O  -4.863822 2.204145 -0.898363
N  0.556409 -1.266999 -0.427309
N  -0.558272 -1.266733 0.425691
C  0.517226 -2.126582 -1.628961
C  -0.519621 -2.126477 1.627257
C  1.651561 -0.415117 -0.127754
C  -1.652598 -0.413605 0.126661
C  1.291077 -3.459526 -1.496269
C  -1.295265 -3.4584 1.494774
C  2.831763 -0.413561 -0.921199
C  -2.832442 -0.410789 0.920635
C  1.597473 0.46989 0.991337
C  -1.598046 0.471384 -0.99242
C  3.915818 0.442444 -0.617194
C  -3.915734 0.44634 0.617093
C  2.675217 1.316437 1.294402
C  -2.675035 1.319062 -1.295018
C  3.845006 1.310861 0.495769
C  -3.844502 1.314675 -0.495905
C  6.081604 2.219416 0.090078
C  -6.080094 2.225336 -0.089403
H  -0.547713 -2.329149 -1.838519
H  0.907696 -1.552804 -2.494264
H  0.545155 -2.330437 1.836271
H  -0.908928 -1.552317 2.492843
H  2.354935 -3.287041 -1.256903
H  0.861562 -4.087501 -0.696052
H  1.238281 -4.028454 -2.443569
H  -2.358997 -3.284496 1.255885
H  -0.866936 -4.086863 0.694304
H  -1.242804 -4.027484 2.441999
H  2.924546 -1.076932 -1.785999
H  -2.925528 -1.074016 1.78551
H  0.694329 0.504473 1.607058
H  -0.695117 0.505033 -1.608507
H  4.803781 0.411559 -1.256485
H  -4.803447 0.416391 1.256775
H  2.626568 1.998693 2.148872
H  -2.626032 2.00128 -2.149497
H  5.869444 2.519393 -0.955837
H  6.587394 1.232855 0.092631
H  6.733182 2.968934 0.563748
H  -6.586755 1.239221 -0.091798
H  -6.731158 2.975435 -0.56286
H  -5.867337 2.52512 0.956447
